program: Gaussian 09
title: 000103788
version: EM64L-G09RevD.01
frameworkgroup: C1[X(C5H10OS)]
method: RPBEPBE
basis: SDD
operation: Freq
keyword: #p
keyword: freq=noraman
keyword: PBEPBE/SDD
title: #p freq=noraman PBEPBE/SDD
converged: YES YES NO NO
title: Mulliken charges:
elementType: S O C C C C C H H H H H H H H H H
charge: 0.181275 -0.200170 -0.470955 -0.643253 0.281094 -0.763050 -0.854862 0.264582 0.250948 0.225242 0.219241 0.235534 0.259031 0.236737 0.253245 0.262579 0.262783
chargesum: 0.00000
title: Mulliken charges with hydrogens summed into heavy atoms:
elementType: S O C C C C C
charge: 0.181275 -0.200170 -0.206374 0.052178 0.281094 -0.031749 -0.076255
polarizability: 9.24307452e+01 -7.23265737e+00 7.06065706e+01 1.15662929e+00 -3.22588885e+00 6.10631550e+01
1716.lowfreq: -29.3839 -8.9129 -0.0032 -0.0032 0.0020 10.1800 27.0534 60.8756 100.2882
frequency: 11.1937 60.8711 100.2361 152.4334 178.1647 199.4142 210.8800 269.0665 284.6364 404.2168 507.5446 578.5755 637.4884 658.6522 762.2331 939.6640 961.0762 963.9931 975.1524 1024.3520 1062.4862 1101.5112 1163.4437 1206.3624 1308.3766 1342.8586 1365.6724 1393.4811 1438.0418 1447.0824 1456.4583 1459.0155 1461.0663 1467.9959 1625.4271 2981.6730 2993.4229 2998.1976 3029.2570 3073.3307 3088.0947 3112.3513 3114.3803 3123.5030 3126.6136
redmass: 2.9805 4.6678 1.0651 1.2168 2.1273 2.3795 1.3529 3.5965 2.9903 3.2163 3.7730 3.8180 2.8750 7.0579 2.9058 1.7669 1.2167 1.2393 1.4536 1.7315 1.5015 2.7010 1.6223 1.4911 1.8143 1.1406 1.2521 1.2071 1.0666 1.0548 1.0440 1.0519 1.0539 1.0478 8.1752 1.0391 1.0374 1.0292 1.0857 1.0932 1.0970 1.1053 1.1010 1.1005 1.1027
irintensity: 0.6153 3.3725 0.0526 0.1988 3.0090 2.0569 0.5177 3.5162 0.4416 5.6153 2.1243 6.4848 0.9990 1.6703 2.0272 8.8023 12.8319 18.5996 0.6876 3.7852 22.2527 3.3385 27.9456 36.6017 31.3377 0.7869 55.7205 21.0775 16.1030 14.2150 20.8222 5.5915 18.5772 12.3519 138.9428 5.1758 22.5650 28.4544 10.6254 12.4547 20.1739 21.9252 10.3856 16.3563 9.6958
temp: 298.150 k
press: 1.00000 atm
elementType: 16 8 6 6 6 6 6 1 1 1 1 1 1 1 1 1 1
symmnumber: 1
zpe: 363784.1 jmol-1
zpe.correction: 0.138558 hartree
zpe.thermalcorrener: 0.148523 hartree
zpe.thermalcorrenthalpy: 0.149467 hartree
zpe.thermalcorrgfe: 0.101632 hartree
zpe.sumelectzpe: -669.230778 hartree
zpe.sumelectthermal: -669.220813 hartree
zpe.sumelectthermalent: -669.219869 hartree
zpe.sumelectthermalfe: -669.267705 hartree
dipole: 2.5685 -1.5075 3.1902
dipole: 4.3644
quadrupole: -54.7833 -48.3482 -51.6404
quadrupole: -0.3490 -1.8496 0.2155
quadrupole: -3.1927 3.2424 -0.0497 -0.3490 -1.8496 0.2155
hfenergy: -669.3693364 hartree
pointgroup: C01 [X(C5H10O1S1)]
dipole: -0.9686477 0.6745967 1.2469892 debye
dipolederiv: -0.3069958 0.0471193 0.0276389 -0.0082966 -0.2203762 0.0183935 -0.0395844 0.0900665 0.0223518 -0.8311899 0.1291723 0.1209337 0.0919874 -0.5860023 -0.1340072 0.2965897 -0.1838732 -0.3707866 -0.1712679 -0.1710025 0.0511782 -0.1765404 0.1746947 -0.1332596 0.0467725 -0.1143416 0.1141395 -0.0178863 0.019689 -0.0148466 -0.0105277 -0.1012626 -0.0165458 -0.0278373 0.0453823 0.015822 1.2042844 0.0457805 -0.1074566 0.2150047 0.7429805 0.3781393 -0.2963425 0.3650003 0.2143258 -0.042447 -0.1009345 -0.0107151 -0.1552415 -0.3756858 -0.2025557 -0.0310912 -0.2310264 -0.0659287 0.0770249 -0.0326914 -0.0923577 -0.0230032 0.0825241 0.0669796 -0.0736196 0.0461678 0.0022107 0.0221642 0.0375844 0.0216637 0.0174749 -0.0194631 -0.072129 0.025074 -0.0368519 -0.0873565 0.1084337 0.0307876 0.05563 -0.0021453 0.0872497 -0.0061038 0.0423004 -0.0723738 -0.0520515 -0.0905094 -0.11053 0.0439118 -0.0582624 0.0409751 0.0129153 0.0389764 0.0119923 0.0977568 0.0146423 0.081331 -0.110693 0.0706635 -0.0064649 0.0620223 -0.1023006 0.0709377 -0.0055964 0.1044967 -0.0159607 -0.0175968 0.00997 0.0749417 0.043673 -0.0357272 0.0090993 -0.0850267 -0.0264222 -0.0909117 0.0635796 -0.0646532 0.0478016 0.0045139 0.087899 0.0438695 0.0845182 -0.0530703 0.1216083 -0.0269069 0.076522 0.0458892 -0.0106993 -0.0283175 0.0359516 0.1053563 0.0132581 -0.0783411 -0.0264678 -0.0501093 -0.0513245 -0.1005687 0.0070866 -0.1404194 0.0078326 0.0138904 -0.0097452 0.0868507 -0.0253089 0.0014635 0.0543445 0.1470993 0.0302303 -0.0506603 -0.0184058 0.0970446 -0.0643462 0.0924661 0.0620595 0.0348875 -0.0569776 0.0301887 0.0530931 unknown
polarizability: 87.5298186|-12.0245648|74.5548978|1.1071124|3.7458573|62.0157544 unknown
InChI: InChI=1S/C5H10OS/c1-4(6)5(2)7-3/h5H,1-3H3
charge 0 multiplicity 1
17 atoms
S  -1.481146 0.087689 -0.922296
O  1.999469 -0.69834 -0.559234
C  -0.262661 -0.704005 0.355216
C  -0.278487 -2.229517 0.22377
C  1.111421 -0.071207 0.077148
C  1.347994 1.333801 0.619306
C  -2.535799 1.141159 0.23057
H  -0.638473 -0.366976 1.338706
H  0.064332 -2.534812 -0.778618
H  -1.294398 -2.624507 0.391228
H  0.411554 -2.684311 0.958967
H  1.538129 1.278325 1.709657
H  2.228483 1.782557 0.133866
H  0.467269 1.980843 0.463636
H  -1.929539 1.920925 0.719261
H  -3.029813 0.508463 0.984869
H  -3.298636 1.619213 -0.404454
