program: Gaussian 09
title: 000103802
version: EM64L-G09RevD.01
frameworkgroup: C1[X(C16H11F3O)]
method: RPBEPBE
basis: SDD
operation: Freq
keyword: #p
keyword: freq=noraman
keyword: PBEPBE/SDD
title: #p freq=noraman PBEPBE/SDD
converged: NO YES NO NO
title: Mulliken charges:
elementType: F F F O C C C C C C C C C C C C C C C C H H H H H H H H H H H
charge: -0.160720 -0.151636 -0.147439 -0.428780 0.123459 0.216184 0.187606 -0.336839 0.456512 0.465143 -0.803931 -0.367502 -0.365967 0.410234 -0.446164 -0.461786 -0.266671 -0.270208 -0.246414 -0.242036 0.257062 0.248148 0.225817 0.309670 0.248189 0.247902 0.231975 0.233063 0.235140 0.233931 0.366059
chargesum: 0.00000
title: Mulliken charges with hydrogens summed into heavy atoms:
elementType: F F F O C C C C C C C C C C C C C C C C
charge: -0.160720 -0.151636 -0.147439 -0.062722 0.123459 0.216184 0.187606 -0.079777 0.456512 0.465143 -0.555783 -0.141685 -0.056297 0.410234 -0.197975 -0.213884 -0.034696 -0.037145 -0.011274 -0.008105
polarizability: 2.63493216e+02 4.83625869e+01 2.25733078e+02 9.08827788e+00 -1.61734727e+01 8.46944667e+01
1716.lowfreq: -4.9881 -0.0007 -0.0006 -0.0003 7.6657 11.5644 33.9869 51.6012 63.9116
frequency: 33.9344 51.5878 63.9067 91.1861 118.4553 158.0110 203.9309 214.2096 222.7163 230.8831 245.8491 269.4364 297.7622 319.2049 381.0184 397.8228 401.8517 422.6676 450.9405 479.3678 497.8291 501.6026 535.3042 566.5380 589.0951 599.3549 628.3462 639.6375 655.1311 709.3618 742.4170 755.4497 767.2821 774.5509 809.4288 838.5977 861.1301 867.1412 876.9048 914.6474 935.2931 963.3854 973.9159 981.3502 991.4629 1002.2843 1018.8707 1022.5820 1029.9701 1037.6350 1055.4877 1106.1119 1145.9567 1164.8159 1175.5548 1192.5054 1202.8010 1253.0413 1257.7973 1285.6910 1293.3272 1323.6965 1336.1099 1367.2779 1377.3804 1393.1758 1416.1828 1434.8134 1446.4591 1453.4513 1493.0887 1538.3004 1566.5847 1586.6868 1629.9708 1634.3104 3020.9001 3119.0519 3124.6808 3126.0924 3137.4818 3138.8453 3156.0319 3161.3655 3169.5395 3201.0852 3580.1132
redmass: 15.3836 5.6922 7.2704 5.1537 3.7606 4.2677 7.1057 2.8785 3.0261 4.0717 3.1189 6.1253 5.9996 4.5394 6.2915 6.5125 4.6324 5.0490 12.7636 2.8497 7.1490 3.5810 5.4509 3.5749 7.3143 6.0018 4.9056 6.3148 7.0618 5.4379 1.4907 3.0830 2.6988 1.5678 2.2955 4.7090 1.7440 4.9137 1.4659 6.2525 1.7262 1.4461 4.8449 1.4690 1.3909 1.4060 3.8262 8.4653 2.3991 2.6431 5.6194 2.3196 2.8800 1.3106 1.1454 1.1870 1.3171 1.5924 1.5567 2.0349 1.8097 2.2121 2.3017 1.7166 1.7899 1.8316 4.3740 9.6981 2.5863 2.0766 2.5992 6.0243 7.7042 5.4284 6.3497 5.9834 1.0821 1.0913 1.0869 1.0868 1.0883 1.0908 1.0942 1.0985 1.0997 1.0939 1.0666
irintensity: 0.1492 0.6955 1.5724 1.1486 5.1577 10.4586 34.1988 46.4737 36.3178 18.3159 21.2814 3.7535 1.3441 1.1677 2.2183 1.3774 0.3741 7.8873 5.0847 2.1140 14.6493 1.6767 5.3740 5.0475 23.2421 7.0804 3.0317 0.1937 0.2103 10.2642 59.8728 1.4072 21.7683 41.5690 32.8180 7.2052 21.5407 9.9942 9.6273 9.2595 20.7456 10.4090 110.8083 26.1597 8.4145 15.4679 83.5595 211.9231 21.4849 21.9994 18.8530 0.4373 172.9086 13.8186 2.6729 3.0694 5.9030 30.1989 20.6157 10.5927 0.4088 0.8230 4.8632 18.0677 5.8442 2.3191 0.2314 0.9985 7.3497 13.6071 0.9435 12.2123 2.1577 0.6090 5.1653 2.5880 15.3308 4.2609 1.0215 4.8856 4.2736 19.5108 29.7618 34.8005 28.1512 5.6878 17.7512
temp: 298.150 k
press: 1.00000 atm
elementType: 9 9 9 8 6 6 6 6 6 6 6 6 6 6 6 6 6 6 6 6 1 1 1 1 1 1 1 1 1 1 1
symmnumber: 1
zpe: 593389.7 jmol-1
zpe.correction: 0.226010 hartree
zpe.thermalcorrener: 0.242159 hartree
zpe.thermalcorrenthalpy: 0.243103 hartree
zpe.thermalcorrgfe: 0.182188 hartree
zpe.sumelectzpe: -989.666589 hartree
zpe.sumelectthermal: -989.650441 hartree
zpe.sumelectthermalent: -989.649496 hartree
zpe.sumelectthermalfe: -989.710412 hartree
dipole: -3.2562 3.1915 1.5366
dipole: 4.8113
quadrupole: -105.6400 -106.3390 -118.4755
quadrupole: 9.3163 1.6271 -3.3734
quadrupole: 4.5115 3.8125 -8.3240 9.3163 1.6271 -3.3734
hfenergy: -989.8925994 hartree
pointgroup: C01 [X(C16H11F3O1)]
dipole: -0.6218713 -1.6928635 -0.5750304 debye
polarizability: 293.860433|-16.2674723|194.5433757|0.9243262|-20.9557558|85.5169518 unknown
InChI: InChI=1S/C16H11F3O/c17-16(18,19)15(20)14-12-7-3-1-5-10(12)9-11-6-2-4-8-13(11)14/h1-9,15,20H
charge 0 multiplicity 1
31 atoms
F  -0.46921 2.721756 1.322844
F  0.627041 4.091046 -0.112548
F  1.768181 2.501307 1.020063
O  1.29669 1.97117 -1.794116
C  -0.000025 0.330901 -0.369762
C  -1.353482 -0.131666 -0.2357
C  1.102529 -0.567122 -0.160652
C  0.229809 1.781033 -0.80354
C  -1.601299 -1.543582 0.049237
C  0.826564 -1.973512 0.132168
C  -0.509274 -2.422423 0.215202
C  -2.514711 0.722889 -0.352021
C  2.493113 -0.166568 -0.211052
C  0.560575 2.757624 0.347396
C  -2.953015 -2.030036 0.162226
C  1.916632 -2.893738 0.337602
C  -3.806966 0.219396 -0.233836
C  3.517463 -1.084624 -0.000328
C  -4.037219 -1.17492 0.018549
C  3.235692 -2.466007 0.271526
H  -0.706761 2.179641 -1.234028
H  -0.703884 -3.482237 0.423135
H  -2.399552 1.800004 -0.499894
H  2.744911 0.877015 -0.401887
H  -3.105809 -3.095421 0.370979
H  1.677981 -3.941605 0.554696
H  -4.661995 0.898629 -0.320743
H  4.558706 -0.745489 -0.034438
H  -5.061946 -1.550316 0.107118
H  4.059665 -3.169173 0.432411
H  1.327795 1.170728 -2.376109
