program: Gaussian 09
title: 000103784
version: EM64L-G09RevD.01
frameworkgroup: C1[X(C12H14O)]
method: RPBEPBE
basis: SDD
operation: Freq
keyword: #pfreq=noraman
keyword: PBEPBE/SDD
title: #p freq=noraman PBEPBE/SDD
converged: YES YES NO NO
title: Mulliken charges:
elementType: O C C C C C C C C C C C C H H H H H H H H H H H H H H
charge: -0.192437 -0.165534 -0.058888 -0.597508 -0.055048 0.311791 0.169542 -0.726887 -0.711234 -0.394960 -0.374974 -0.214135 -0.228431 0.247434 0.233406 0.237903 0.235003 0.215482 0.217989 0.213187 0.198964 0.215415 0.241099 0.245190 0.273693 0.229354 0.234583
chargesum: 0.00000
title: Mulliken charges with hydrogens summed into heavy atoms:
elementType: O C C C C C C C C C C C C
charge: -0.192437 0.081900 0.174517 -0.124602 -0.055048 0.311791 0.169542 -0.080229 -0.055755 -0.149770 -0.101280 0.015219 0.006152
polarizability: 1.69880182e+02 -4.66488252e+00 1.31876384e+02 9.85310561e+00 7.67255599e-01 7.95626038e+01
1716.lowfreq: -11.0544 -6.1789 -0.0003 0.0005 0.0008 13.7336 25.3513 70.8944 124.0635
frequency: 24.4808 70.8464 124.0569 145.1849 195.6506 201.6274 232.2362 249.9205 275.7558 294.2616 383.3896 412.9646 457.4552 467.9000 519.2809 539.7492 579.7704 609.1413 680.7613 712.7741 758.2471 786.2170 805.9119 836.9224 883.7066 905.3477 917.0779 952.4793 959.1738 980.1379 1001.1646 1002.2276 1015.5221 1040.5346 1088.7749 1092.5525 1146.7221 1164.4778 1166.9803 1183.8357 1193.1925 1210.3745 1224.0418 1265.4517 1278.3590 1295.4735 1318.5271 1345.6147 1379.0315 1395.8745 1398.7118 1445.5349 1452.3933 1464.9470 1466.4017 1474.8542 1485.4175 1486.0221 1594.5022 1609.3149 1628.7581 2963.1900 2966.9461 2976.5251 2988.0502 2993.9435 3043.4131 3058.4684 3065.9109 3069.2817 3079.3924 3123.8836 3137.3318 3148.8473 3164.6819
redmass: 3.5695 2.4810 3.8358 4.5134 1.3970 2.1552 1.1132 2.9580 3.8214 2.9088 2.5339 2.8278 3.5620 3.4692 2.8331 6.8010 3.1940 5.4824 4.4923 3.6763 1.5063 3.3656 2.6288 4.3931 1.4594 2.0002 1.1927 1.4656 1.5975 1.6922 1.7690 1.5819 2.2300 2.3646 2.1948 1.9644 1.7031 1.4044 1.1517 1.7929 1.9506 1.5498 1.5755 1.5744 2.1538 1.6112 1.4814 1.3854 1.2138 1.7369 2.6265 1.3764 2.1540 1.5332 1.1815 1.0917 1.0566 1.0500 7.0664 7.8564 10.6289 1.0809 1.0356 1.0371 1.0832 1.0618 1.1003 1.0991 1.0992 1.0983 1.0996 1.0863 1.0896 1.0947 1.1003
irintensity: 0.6093 0.3182 1.3514 2.6262 1.0249 2.1571 0.1374 3.0648 3.0609 0.9356 0.2100 3.5097 3.0433 5.0939 3.9489 0.4581 3.6024 0.4953 6.0412 6.7493 72.0377 9.9736 6.1850 5.1773 1.3099 5.6956 4.7712 4.8737 1.0944 4.3563 14.1403 9.7666 4.1396 9.7649 16.7688 0.2255 1.4833 3.6020 2.8328 29.1184 8.2400 10.1243 8.3260 0.5351 75.9551 3.8223 6.7643 0.5869 22.6739 13.1694 9.0589 5.7886 27.8778 5.0201 3.3271 3.6110 14.9559 21.9370 15.0884 137.2555 119.9222 14.3541 35.3480 17.4375 11.9164 18.0105 15.8872 20.2259 28.0103 83.0985 36.8275 1.9232 9.3882 17.3491 29.8989
temp: 298.150 k
press: 1.00000 atm
elementType: 8 6 6 6 6 6 6 6 6 6 6 6 6 1 1 1 1 1 1 1 1 1 1 1 1 1 1
symmnumber: 1
zpe: 592497.7 jmol-1
zpe.correction: 0.225670 hartree
zpe.thermalcorrener: 0.237671 hartree
zpe.thermalcorrenthalpy: 0.238615 hartree
zpe.thermalcorrgfe: 0.187122 hartree
zpe.sumelectzpe: -539.959401 hartree
zpe.sumelectthermal: -539.947400 hartree
zpe.sumelectthermalent: -539.946456 hartree
zpe.sumelectthermalfe: -539.997950 hartree
dipole: 0.9929 -3.4926 0.1298
dipole: 3.6333
quadrupole: -67.7615 -81.6603 -79.1351
quadrupole: 2.1719 1.4387 1.6601
quadrupole: 8.4241 -5.4747 -2.9495 2.1719 1.4387 1.6601
hfenergy: -540.1850713 hartree
pointgroup: C01 [X(C12H14O1)]
dipole: -0.4096232 1.3683171 -0.0570596 debye
polarizability: 170.5408859|-4.6103359|131.3691581|-6.5562839|-4.6579425|79.4091249 unknown
InChI: InChI=1S/C12H14O/c1-8(2)11-7-9-5-3-4-6-10(9)12(11)13/h3-6,8,11H,7H2,1-2H3
charge 0 multiplicity 1
27 atoms
O  0.75469 -2.339948 -0.171686
C  1.405122 0.035771 -0.597525
C  2.736336 -0.06012 0.207253
C  0.564681 1.340007 -0.434207
C  0.43043 -1.124623 -0.27108
C  -0.868331 0.864038 -0.223704
C  -0.930356 -0.548342 -0.113068
C  3.761892 0.982875 -0.293729
C  2.523639 0.048162 1.735887
C  -2.050751 1.62573 -0.114592
C  -2.1499 -1.226278 0.116321
C  -3.27704 0.954492 0.108664
C  -3.329811 -0.461477 0.225811
H  1.670868 -0.086842 -1.669497
H  3.134382 -1.074384 -0.000043
H  0.649173 2.006412 -1.311984
H  0.90492 1.928033 0.43971
H  3.401935 2.015681 -0.12209
H  4.724165 0.873656 0.239791
H  3.958955 0.86819 -1.376489
H  2.123766 1.037884 2.028566
H  3.48552 -0.085817 2.264109
H  1.828496 -0.728528 2.101794
H  -2.026778 2.718378 -0.198115
H  -2.159998 -2.318238 0.200289
H  -4.203303 1.534442 0.194628
H  -4.292801 -0.953953 0.399486
