program: Gaussian 09
title: 000103796
version: EM64L-G09RevD.01
frameworkgroup: C1[X(C12H18O)]
method: RPBEPBE
basis: SDD
operation: Freq
keyword: #pfreq=noraman
keyword: PBEPBE/SDD
title: #p freq=noraman PBEPBE/SDD
converged: YES YES NO NO
title: Mulliken charges:
elementType: O C C C C C C C C C C C C H H H H H H H H H H H H H H H H H H
charge: -0.194825 -0.122639 -0.487113 -0.538060 -0.469746 0.505021 -0.440149 0.487741 -0.581155 -0.452459 -0.830612 -0.732167 -0.059434 0.195068 0.225195 0.206694 0.217870 0.206169 0.222859 0.205633 0.215394 0.233713 0.221561 0.247227 0.240798 0.222573 0.223363 0.228225 0.213249 0.217763 0.172243
chargesum: 0.00000
title: Mulliken charges with hydrogens summed into heavy atoms:
elementType: O C C C C C C C C C C C C
charge: -0.194825 0.072429 -0.055225 -0.114021 -0.041254 0.505021 -0.224755 0.487741 -0.125881 0.035567 -0.156451 -0.301154 0.112809
polarizability: 1.68036721e+02 1.12598224e+01 1.24509364e+02 -2.74394166e+00 3.07005963e+00 9.37841608e+01
1716.lowfreq: -24.8479 -5.6846 -0.0007 -0.0003 0.0002 8.7912 12.4072 32.4451 43.5229
frequency: -16.3655 32.4161 43.4389 66.3057 129.2396 154.0540 161.8957 167.4012 178.2617 207.9048 281.0253 309.0843 318.2879 368.4169 431.6947 446.1548 485.5578 523.9165 548.6367 605.0811 666.2253 695.2038 716.3212 772.0426 800.2019 810.2679 849.1349 888.7390 900.2540 918.2876 926.4956 935.8680 959.0468 988.7724 1002.8541 1034.8939 1049.6574 1063.9582 1066.0581 1071.3228 1121.7343 1137.9288 1159.0381 1173.2077 1209.8841 1227.4831 1255.7632 1261.0239 1265.5885 1286.3695 1296.3382 1313.5151 1325.4513 1348.3382 1360.8855 1373.4548 1375.5658 1392.8664 1423.7213 1426.2880 1453.0600 1457.1234 1462.3350 1463.4956 1469.7205 1477.4316 1643.4307 1663.5385 1690.1168 2849.0249 2930.3841 2941.0337 2955.7760 2956.2774 2964.6142 2978.1929 2982.0207 2996.3829 2998.6836 3009.5810 3036.7785 3051.5484 3051.8736 3084.9578 3091.3309 3097.2972 3196.0106
redmass: 2.4510 5.6060 4.1370 2.8668 3.8967 1.1843 2.4714 1.7892 3.8150 2.3931 2.7891 3.2426 2.3134 2.5719 2.4720 2.2669 2.6418 2.9531 2.8487 4.6707 1.1681 1.3464 2.5299 2.7580 1.5568 1.3819 1.5027 2.7297 2.5540 1.4982 1.3305 2.1535 2.0504 2.0046 1.4522 1.7496 1.6682 2.2511 2.2759 2.1937 1.6301 1.6114 1.5247 1.4578 1.3992 1.5112 1.4168 1.5096 1.1628 1.3363 1.6274 1.3400 1.4185 1.6272 2.1789 1.3918 1.4132 1.2270 1.0898 1.1825 1.0931 1.0798 1.0894 1.0547 1.0854 1.0625 7.5582 4.8520 6.9624 1.0841 1.0811 1.0623 1.0614 1.0615 1.0378 1.0658 1.0764 1.0930 1.0804 1.0969 1.0964 1.0994 1.1009 1.0981 1.0906 1.0630 1.1128
irintensity: 0.1019 2.9424 4.4879 2.1205 5.2736 0.5855 1.8258 1.3625 2.5155 0.7341 2.9063 3.7873 1.1830 0.7367 5.4156 1.5402 4.1083 6.6020 1.9532 4.7605 8.4933 0.5331 1.7710 4.4144 2.8129 13.0047 3.7878 0.2825 11.3945 4.4047 67.9400 3.7911 4.7727 2.8774 2.4959 4.5873 0.7650 4.9719 2.4486 0.3411 3.4289 6.8473 4.9192 2.1260 1.2140 7.7420 2.6337 32.1534 5.2408 2.3192 10.4159 10.3959 1.9936 9.8449 3.4512 1.0571 5.3689 22.3468 34.5198 2.8059 2.1788 12.1144 20.7196 9.5316 6.1575 26.1129 139.4996 32.0606 1.8118 169.1787 13.3454 40.9332 60.8932 14.3429 35.6569 14.6523 15.7205 17.8713 38.4773 36.7509 30.5918 11.9896 61.6545 32.5759 36.3929 10.2395 27.8561
temp: 298.150 k
press: 1.00000 atm
elementType: 8 6 6 6 6 6 6 6 6 6 6 6 6 1 1 1 1 1 1 1 1 1 1 1 1 1 1 1 1 1 1
symmnumber: 1
zpe: 701375.6 jmol-1
zpe.correction: 0.267140 hartree
zpe.thermalcorrener: 0.280591 hartree
zpe.thermalcorrenthalpy: 0.281536 hartree
zpe.thermalcorrgfe: 0.226254 hartree
zpe.sumelectzpe: -542.242851 hartree
zpe.sumelectthermal: -542.229400 hartree
zpe.sumelectthermalent: -542.228455 hartree
zpe.sumelectthermalfe: -542.283737 hartree
dipole: 1.9556 -2.1885 -1.5404
dipole: 3.3146
quadrupole: -98.7632 -76.1299 -79.9254
quadrupole: 5.9834 6.6520 0.3716
quadrupole: -13.8237 8.8096 5.0141 5.9834 6.6520 0.3716
hfenergy: -542.5099909 hartree
pointgroup: C01 [X(C12H18O1)]
dipole: -0.7878575 -0.4427435 0.9401437 debye
polarizability: 167.6498976|-11.6430663|114.7763298|3.8043183|-14.9274836|103.9040183 unknown
InChI: InChI=1S/C12H18O/c1-10(2)12-7-5-11(6-8-12)4-3-9-13/h5,9,12H,1,3-4,6-8H2,2H3
charge 0 multiplicity 1
31 atoms
O  5.289828 0.040946 -0.214466
C  -1.975136 0.133633 0.221044
C  -1.315869 -1.126478 -0.419111
C  0.200156 -1.164247 -0.118893
C  -1.357712 1.394092 -0.42952
C  0.88354 0.176591 -0.369772
C  0.156464 1.318756 -0.518744
C  -3.504849 0.068576 0.180678
C  2.401273 0.175729 -0.46549
C  3.089615 -0.256166 0.850739
C  -4.138122 -0.925481 1.143659
C  -4.278113 0.836247 -0.634234
C  4.606447 -0.248678 0.796859
H  -1.678751 0.132706 1.294618
H  -1.482939 -1.089275 -1.513564
H  -1.792881 -2.052797 -0.048621
H  0.687473 -1.944633 -0.739691
H  0.35887 -1.47661 0.93626
H  -1.658667 2.296397 0.139481
H  -1.769155 1.531821 -1.451852
H  0.683909 2.261107 -0.728899
H  2.77019 1.179481 -0.744964
H  2.736119 -0.510575 -1.269756
H  2.778852 0.399225 1.693032
H  2.781056 -1.279228 1.157131
H  -3.779006 -1.957063 0.962141
H  -3.875609 -0.677294 2.191356
H  -5.23804 -0.93062 1.058099
H  -5.371025 0.747641 -0.627079
H  -3.858062 1.575224 -1.323802
H  5.109345 -0.53023 1.76026
