program: Gaussian 09
title: 000103898
version: EM64L-G09RevD.01
frameworkgroup: C1[X(C24H21N5O5)]
method: RPBEPBE
basis: SDD
operation: Freq
keyword: #p
keyword: freq=noraman
keyword: PBEPBE/SDD
title: #p freq=noraman PBEPBE/SDD
converged: YES YES NO NO
title: Mulliken charges:
elementType: O O O O O N N N N N C C C C C C C C C C C C C C C C C C C C C C C C H H H H H H H H H H H H H H H H H H H H H
charge: -0.241408 -0.296207 -0.444020 -0.257231 -0.192186 -0.206499 -0.096921 -0.023699 0.017516 -0.437193 -0.034174 -0.526111 -0.042273 -0.072107 -0.378164 0.126170 -0.209659 -0.140604 0.192285 0.189697 0.214223 -0.377672 -0.336760 -0.337052 0.150029 -0.219950 -0.216390 -0.219115 0.248285 -0.336435 -0.348939 -0.224688 -0.240284 -0.225332 0.253645 0.273256 0.266437 0.273105 0.293716 0.207715 0.239205 0.334020 0.356010 0.250527 0.351815 0.269793 0.268601 0.236610 0.235135 0.235954 0.275324 0.222475 0.234112 0.231531 0.233884
chargesum: 0.00000
title: Mulliken charges with hydrogens summed into heavy atoms:
elementType: O O O O O N N N N N C C C C C C C C C C C C C C C C C C C C C C C C
charge: -0.241408 -0.296207 -0.088010 -0.257231 -0.192186 -0.206499 -0.096921 -0.023699 0.017516 -0.085378 0.219471 0.013582 0.230832 0.221609 0.068756 0.126170 0.124361 -0.140604 0.192285 0.189697 0.214223 -0.127146 -0.066967 -0.068451 0.150029 0.016660 0.018745 0.016839 0.248285 -0.061111 -0.126464 0.009424 -0.008753 0.008553
polarizability: 5.13120136e+02 -1.91645457e+01 3.02720393e+02 1.22662448e+01 -8.08078813e+00 1.65372183e+02
1716.lowfreq: -15.9612 -4.9074 -2.3689 -0.0013 0.0006 0.0011 1.8115 11.8460 18.6432
frequency: -9.4608 8.3166 18.5077 20.0183 22.4263 29.7248 38.3667 48.6558 66.6408 72.4099 78.7761 103.5648 111.3643 135.8310 147.4782 166.3356 174.1478 174.7402 192.8823 215.0582 224.9854 232.1704 252.7946 260.9377 295.5998 299.2173 302.5923 314.8239 345.1995 400.7649 402.2198 406.5494 413.6003 422.3116 441.3006 466.3834 495.0168 525.7367 535.3400 557.7816 576.7935 603.7937 613.5237 613.7202 634.9071 650.1036 657.9524 665.6776 680.8989 685.1330 694.5191 700.6645 701.0658 724.3364 742.6233 745.6973 747.7070 794.4497 795.3545 795.8156 803.4772 805.0339 839.0374 848.7004 854.2258 864.4327 866.6355 869.6904 922.9405 925.4723 938.0880 947.4747 955.1611 963.5308 979.6639 986.0512 989.4180 990.3295 992.7084 996.1600 1007.0883 1010.2798 1015.7175 1021.6072 1028.8794 1044.3625 1052.2499 1071.2761 1076.1348 1086.6386 1088.6135 1091.9621 1109.8687 1145.3321 1174.2501 1175.5237 1177.1317 1183.8661 1195.1227 1195.9827 1204.2558 1223.2069 1226.9630 1232.4556 1246.3535 1250.6985 1263.7853 1277.5732 1292.4824 1294.9512 1302.1938 1316.6040 1320.6652 1331.4778 1343.2121 1355.0434 1360.2532 1367.8068 1385.4718 1390.8326 1412.7002 1417.4787 1432.4209 1438.5802 1441.1612 1454.1819 1467.9807 1476.5315 1477.9493 1491.6990 1540.7212 1576.7083 1582.7877 1585.3916 1609.7601 1610.6737 1616.7902 1632.7345 2946.1440 3005.2456 3049.6566 3054.1993 3062.7209 3098.2380 3119.4559 3123.7196 3133.0883 3133.3246 3145.2390 3146.3937 3157.0124 3158.9035 3168.5399 3170.2316 3170.4295 3180.3764 3226.7065 3492.9724 3577.3411
redmass: 5.1574 5.8107 5.1133 4.7101 5.3257 5.6873 6.0445 6.9280 6.8665 6.8114 7.3259 6.6630 4.5632 5.8025 4.8588 3.6554 4.8142 6.9975 4.5596 6.4963 5.1612 5.2962 4.1099 1.2831 5.8229 7.1224 6.3505 8.2183 6.2220 2.8714 2.8172 5.7775 5.3743 3.6588 3.7626 4.9253 4.2445 3.6304 7.3469 3.6458 7.4901 6.4579 6.4465 6.4177 5.6503 5.9861 6.9038 5.7597 5.1884 4.2136 4.6294 1.6138 1.5161 5.2762 4.5906 1.6502 3.9835 2.7215 2.8465 2.3987 6.1683 7.0526 7.7130 3.8388 1.3548 1.2454 2.9137 1.7687 3.6758 1.4623 1.4680 3.2720 1.4246 3.9574 5.7197 1.4600 4.9617 5.6907 2.1920 1.3908 1.3493 1.3328 3.6275 3.3445 2.4618 3.1289 4.2026 2.5535 2.2560 1.8275 1.8789 2.0349 4.4201 4.9066 1.0619 1.0605 1.3842 1.1402 1.1532 1.1600 1.5542 1.7968 1.2405 3.6194 2.6455 1.5334 2.2720 7.0658 1.4065 1.5848 3.9047 1.3201 1.3785 1.3115 1.8790 1.7498 1.3317 2.4521 8.2678 9.9478 1.4433 3.0984 2.2714 2.2465 2.6109 1.1148 1.0779 2.3876 2.2800 2.7442 8.0737 5.8171 6.9194 4.9871 5.8062 6.3696 9.4156 5.6368 1.0565 1.1047 1.0779 1.0842 1.0747 1.0885 1.0876 1.1036 1.0857 1.0870 1.0891 1.0918 1.0939 1.0957 1.0980 1.0940 1.0991 1.0980 1.1012 1.0760 1.0667
irintensity: 1.3248 2.1181 0.5397 0.0037 1.1406 3.8050 0.4127 2.4922 1.2483 0.6267 1.5620 1.5671 5.2866 1.5504 13.8590 20.9299 1.1303 0.6520 4.2191 1.3311 1.5043 21.8059 3.6118 146.8946 2.1399 5.5832 1.8692 15.6035 4.8243 0.1265 0.0225 7.3278 0.7484 17.8298 2.9478 6.7822 14.2439 5.4952 13.2468 4.4918 9.0058 3.9587 0.6942 1.5457 25.0975 37.0691 1.4657 47.4695 8.3883 1.6042 13.5176 108.9051 42.0396 21.1024 23.0389 88.3919 17.7643 24.5423 4.3282 18.5684 31.8180 11.7197 11.5928 23.1456 0.0055 0.1060 13.8067 11.7898 52.8373 14.9449 4.3665 35.9532 5.1601 39.4126 54.8697 3.1543 3.8097 9.6504 37.6485 0.0108 3.1801 0.2541 73.6192 187.0620 10.9504 397.6642 20.9682 19.6271 16.6077 13.2164 24.0202 6.2084 1.9585 38.8140 8.0357 3.3966 182.3644 25.9143 79.7356 18.6916 44.7023 300.6956 20.2246 102.5020 351.5631 37.4952 24.6557 42.8116 26.4950 73.0529 33.5540 2.7398 4.2652 45.3517 118.5402 69.2854 5.2341 9.3140 1.2137 3.2884 4.1579 530.6799 4.9464 18.8119 5.6145 31.8153 12.1623 54.6873 5.4836 166.8713 197.5904 524.7900 52.4009 169.8167 18.5212 12.8464 158.2802 142.2704 40.7818 47.4397 3.7518 17.3710 5.4483 20.2393 12.6181 7.6111 0.2232 1.9385 8.6168 20.0057 13.9220 13.9627 22.8578 28.3235 13.0149 8.7713 39.0180 25.9490 9.5392
temp: 298.150 k
press: 1.00000 atm
elementType: 8 8 8 8 8 7 7 7 7 7 6 6 6 6 6 6 6 6 6 6 6 6 6 6 6 6 6 6 6 6 6 6 6 6 1 1 1 1 1 1 1 1 1 1 1 1 1 1 1 1 1 1 1 1 1
symmnumber: 1
zpe: 1095228.5 jmol-1
zpe.correction: 0.417150 hartree
zpe.thermalcorrener: 0.445352 hartree
zpe.thermalcorrenthalpy: 0.446296 hartree
zpe.thermalcorrgfe: 0.353173 hartree
zpe.sumelectzpe: -1574.630421 hartree
zpe.sumelectthermal: -1574.602219 hartree
zpe.sumelectthermalent: -1574.601275 hartree
zpe.sumelectthermalfe: -1574.694399 hartree
dipole: 4.5778 3.7888 -0.6666
dipole: 5.9796
quadrupole: -154.5708 -194.4533 -203.0202
quadrupole: -37.0103 -3.3181 -12.8309
quadrupole: 29.4440 -10.4386 -19.0054 -37.0103 -3.3181 -12.8309
hfenergy: -1575.0475716 hartree
pointgroup: C01 [X(C24H21N5O5)]
dipole: -1.8570995 1.4411755 -0.0929711 debye
polarizability: 510.7282145|29.9099212|301.858263|14.7578324|-20.3055098|168.6262342 unknown
InChI: InChI=1S/C24H21N5O5/c30-12-18-17(34-24(32)16-9-5-2-6-10-16)11-19(33-18)29-14-27-20-21(25-13-26-22(20)29)28-23(31)15-7-3-1-4-8-15/h1-10,13-14,17-19,28,30H,11-12H2
charge 0 multiplicity 1
55 atoms
O  -2.035803 0.48737 -1.528812
O  -4.513524 -0.287794 0.261858
O  -1.457788 3.260194 -1.127875
O  -5.511711 1.68342 1.004929
O  6.205431 -1.810107 1.170928
N  0.056926 -0.265826 -0.631862
N  2.076148 0.792502 -0.913511
N  0.827854 -2.22789 0.704291
N  3.261274 -2.155569 1.108683
N  4.618779 -0.337794 0.228563
C  -3.194829 0.334376 0.566196
C  -2.139368 -0.79135 0.527345
C  -1.388271 -0.60117 -0.82263
C  -2.78266 1.322703 -0.550174
C  -1.953866 2.485086 0.014889
C  1.006216 -1.061236 0.019976
C  0.753892 0.824514 -1.183466
C  2.245005 -0.386688 -0.166228
C  -5.63115 0.520301 0.540466
C  3.39746 -0.991665 0.410539
C  -6.914625 -0.162828 0.228768
C  2.006747 -2.700243 1.215417
C  -8.121792 0.534881 0.497817
C  -6.957732 -1.468959 -0.326171
C  5.923086 -0.70711 0.635301
C  -9.362638 -0.070978 0.216567
C  -8.202595 -2.069645 -0.606628
C  -9.405171 -1.373749 -0.336109
C  6.975821 0.338384 0.346106
C  8.325704 -0.09928 0.328724
C  6.690606 1.713083 0.127054
C  9.370031 0.812411 0.075667
C  7.738503 2.626436 -0.121726
C  9.079099 2.178433 -0.154531
H  -3.277014 0.834057 1.546956
H  -2.63569 -1.772573 0.569399
H  -1.445191 -0.732717 1.379319
H  -1.440117 -1.491107 -1.471488
H  -3.639771 1.726777 -1.109616
H  -1.109742 2.11127 0.633574
H  -2.628822 3.09024 0.655381
H  0.230322 1.602474 -1.736787
H  -1.072834 4.112902 -0.804992
H  1.946538 -3.632867 1.783732
H  4.526443 0.519815 -0.326613
H  -8.063697 1.542198 0.923253
H  -6.021978 -1.995096 -0.533372
H  -10.293296 0.467209 0.425081
H  -8.237562 -3.076723 -1.035489
H  -10.370309 -1.843736 -0.555582
H  8.526152 -1.157902 0.523641
H  5.664799 2.09761 0.184464
H  10.407724 0.46223 0.058267
H  7.509869 3.685652 -0.281648
H  9.890117 2.888674 -0.349939
