program: Gaussian 09
title: 000103786
version: EM64L-G09RevD.01
frameworkgroup: C1[X(C14H10F2O2)]
method: RPBEPBE
basis: SDD
operation: Freq
keyword: #p
keyword: freq=noraman
keyword: PBEPBE/SDD
title: #p freq=noraman PBEPBE/SDD
converged: YES YES NO NO
title: Mulliken charges:
elementType: F F O O C C C C C C C C C C C C C C H H H H H H H H H H
charge: -0.202274 -0.189000 -0.440533 -0.242277 -0.362392 0.586931 0.058572 0.335695 -0.416796 -0.345836 -0.317437 -0.320553 -0.372924 -0.359459 0.316403 -0.381614 -0.368743 0.334113 0.236856 0.239718 0.258053 0.249307 0.285466 0.259319 0.258006 0.264968 0.266686 0.369743
chargesum: 0.00000
title: Mulliken charges with hydrogens summed into heavy atoms:
elementType: F F O O C C C C C C C C C C C C C C
charge: -0.202274 -0.189000 -0.070790 -0.242277 -0.125536 0.586931 0.058572 0.335695 -0.177078 -0.087783 -0.068130 -0.035087 -0.113605 -0.101453 0.316403 -0.116646 -0.102057 0.334113
polarizability: 1.79876650e+02 -1.01638005e+00 1.56321679e+02 -8.26444331e+00 -1.98135393e+01 1.27312366e+02
1716.lowfreq: -15.2292 -7.4334 -0.0012 -0.0010 -0.0007 4.7156 23.8538 25.2873 43.1514
frequency: 23.7426 25.2429 43.1205 78.6096 103.7851 121.7928 148.7694 196.9130 259.4294 284.8456 292.7996 342.5484 378.8820 388.2429 392.1204 408.1243 412.2666 457.8783 482.2392 484.2023 510.1371 555.4899 590.7165 619.7505 627.0808 644.7858 721.7707 733.0606 770.3098 791.4274 812.0161 819.6567 824.5233 833.4178 847.5316 864.2013 943.4140 951.7566 953.6373 962.7129 988.8881 1002.2487 1005.5292 1029.2723 1104.1472 1110.0251 1154.7185 1159.3451 1186.7025 1202.1326 1205.1586 1207.5461 1264.4362 1279.3812 1296.0885 1305.9322 1367.8081 1387.7117 1389.8105 1410.0040 1414.5273 1491.5913 1492.1780 1555.0592 1595.9490 1603.1717 1608.1907 1609.6552 2995.4888 3125.9614 3141.5242 3161.5564 3165.0212 3174.8563 3177.2171 3181.9027 3185.7181 3388.3588
redmass: 4.2138 8.3919 4.0931 10.6900 9.2299 7.8478 7.5768 7.4194 7.4458 7.2004 8.5419 7.4120 7.3530 5.1905 5.4764 2.9072 3.0948 2.9563 1.5133 4.1619 2.9970 3.2815 6.6175 6.9518 7.2609 5.1653 4.0599 3.9771 5.1762 5.3902 1.6098 1.2753 2.2119 2.2319 2.2723 2.2535 1.3794 1.6128 3.7618 1.3691 1.3528 2.9277 2.7591 4.0100 1.3232 1.3095 1.4596 1.4420 2.1314 2.5427 1.4254 2.2691 3.5595 1.3796 1.2648 1.4215 1.9269 2.3947 6.3030 2.7834 3.7472 2.5788 2.6315 8.5066 7.6872 7.4565 6.3742 6.4807 1.0836 1.0904 1.0900 1.0892 1.0883 1.0952 1.0960 1.0968 1.0977 1.0639
irintensity: 0.0323 0.0302 0.1230 1.6299 1.0419 1.1214 2.7422 6.4880 6.9103 2.7405 1.1631 21.5819 6.9467 6.3336 7.8367 0.7327 0.4393 19.6808 120.4905 1.8295 17.9562 45.4942 10.3075 5.0624 2.6916 19.8306 0.3959 9.7382 9.6010 23.1141 19.9670 2.7663 33.1523 12.8905 54.1172 49.0327 0.8012 22.9202 126.5927 1.4636 0.5789 6.4324 8.7659 43.1085 11.3640 10.8366 81.4453 51.5761 19.5128 62.8186 6.7130 30.7702 259.7412 66.3823 4.8561 5.7917 81.3185 11.0145 0.4181 4.7909 9.1757 75.8981 61.8348 111.0857 34.1539 17.5498 72.5694 58.1310 32.1399 9.9902 3.3282 0.0533 3.2050 2.6948 2.4702 2.5019 2.6318 58.4255
temp: 298.150 k
press: 1.00000 atm
elementType: 9 9 8 8 6 6 6 6 6 6 6 6 6 6 6 6 6 6 1 1 1 1 1 1 1 1 1 1
symmnumber: 1
zpe: 531308.0 jmol-1
zpe.correction: 0.202365 hartree
zpe.thermalcorrener: 0.217621 hartree
zpe.thermalcorrenthalpy: 0.218566 hartree
zpe.thermalcorrgfe: 0.157620 hartree
zpe.sumelectzpe: -888.348687 hartree
zpe.sumelectthermal: -888.333430 hartree
zpe.sumelectthermalent: -888.332486 hartree
zpe.sumelectthermalfe: -888.393432 hartree
dipole: 2.1096 -1.3548 0.5987
dipole: 2.5777
quadrupole: -113.3786 -116.1554 -93.9542
quadrupole: 3.5976 -1.8361 -8.0360
quadrupole: -5.5492 -8.3260 13.8752 3.5976 -1.8361 -8.0360
hfenergy: -888.5510516 hartree
pointgroup: C01 [X(C14H10F2O2)]
dipole: -0.8251005 0.4831733 0.3380012 debye
polarizability: 180.0626718|-2.235812|148.3773347|7.4189841|23.6829622|135.0706891 unknown
InChI: InChI=1S/C14H10F2O2/c15-11-5-1-9(2-6-11)13(17)14(18)10-3-7-12(16)8-4-10/h1-8,13,17H
charge 0 multiplicity 1
28 atoms
F  4.376262 2.474067 -0.37055
F  -4.63894 2.211028 0.515199
O  1.324625 -3.087423 0.309542
O  -0.704304 -2.5327 -1.266913
C  0.67509 -1.81068 0.574625
C  1.634739 -0.642809 0.321078
C  -0.592101 -1.696497 -0.315381
C  -1.621827 -0.65232 -0.069837
C  2.163782 0.098305 1.404506
C  2.04728 -0.331557 -0.999933
C  -1.535538 0.271917 1.008403
C  -2.742818 -0.596584 -0.946328
C  3.085866 1.146061 1.186301
C  2.963786 0.712355 -1.241295
C  3.459541 1.429772 -0.137582
C  -2.543822 1.23414 1.210482
C  -3.757629 0.358122 -0.760772
C  -3.631783 1.254028 0.318599
H  0.374325 -1.812024 1.641118
H  1.875208 -0.156219 2.431678
H  1.657964 -0.910204 -1.84487
H  -0.679902 0.256814 1.688824
H  -2.795442 -1.317447 -1.767987
H  3.511996 1.722749 2.012032
H  3.293118 0.968769 -2.25232
H  -2.496877 1.955312 2.030852
H  -4.625709 0.417013 -1.423008
H  0.911012 -3.445389 -0.529964
