program: Gaussian 09
title: 000103772
version: EM64L-G09RevD.01
frameworkgroup: C1[X(C8H16ClN)]
method: RPBEPBE
basis: SDD
operation: Freq
keyword: #p
keyword: freq=noraman
keyword: PBEPBE/SDD
title: #p freq=noraman PBEPBE/SDD
converged: NO YES NO NO
title: Mulliken charges:
elementType: Cl N C C C C C C C C H H H H H H H H H H H H H H H H
charge: -0.094488 -0.105448 -0.083808 -0.393640 -0.416444 -0.378124 -0.380617 -0.302453 -0.725792 -0.581974 0.216347 0.208007 0.190449 0.190115 0.207564 0.214753 0.197035 0.194106 0.202953 0.218156 0.227512 0.224838 0.220310 0.220046 0.262244 0.268355
chargesum: 0.00000
title: Mulliken charges with hydrogens summed into heavy atoms:
elementType: Cl N C C C C C C C C
charge: -0.094488 -0.105448 0.132538 0.004816 -0.004657 0.019555 0.016442 0.143215 -0.060598 -0.051376
polarizability: 1.31266702e+02 -1.71964935e+00 9.25177561e+01 3.07129569e+00 2.88810018e-02 8.22283938e+01
1716.lowfreq: -27.2786 -0.0022 -0.0013 0.0014 5.1011 10.7321 47.8295 69.3621 107.2691
frequency: 46.9976 69.1806 107.1812 151.5216 182.3832 204.0798 238.2218 260.8959 318.4872 335.0439 381.7601 434.5582 464.8959 510.5292 597.3653 649.8394 728.7683 773.7453 807.2410 826.1444 851.4308 884.5434 920.2838 969.0884 991.5893 1010.2162 1028.9930 1056.4502 1077.3373 1081.5592 1104.5536 1139.2149 1151.7673 1158.5723 1185.8890 1240.5659 1252.0465 1263.0293 1279.5595 1294.6281 1308.7539 1336.0688 1337.6338 1342.4088 1350.4808 1361.3194 1371.7630 1379.4984 1449.3669 1450.4594 1458.4426 1467.0733 1469.1680 1477.7328 1483.5784 1492.7493 2862.2083 2936.0640 2974.0108 2976.6414 2980.7869 2984.5146 2992.1433 3025.4948 3034.3218 3043.2635 3048.4257 3053.7336 3064.8964 3070.4006 3084.9151 3153.5492
redmass: 3.5808 4.5472 2.2101 2.6809 1.2409 2.4843 2.9505 3.2653 1.9887 2.3296 2.0142 2.9938 3.1280 2.4118 2.4292 3.8664 3.4462 1.1517 1.7050 2.0066 2.4096 1.4772 2.0386 1.6388 1.5532 1.5038 2.0109 2.6562 2.0530 1.5678 2.2184 1.3449 2.0922 1.8708 1.5797 1.2438 1.4644 1.2872 1.2314 1.3451 1.4843 1.3449 1.3960 1.3795 1.4182 1.4018 1.3231 1.2679 1.0903 1.0949 1.0797 1.0689 1.0719 1.0777 1.0704 1.0770 1.0708 1.0680 1.0726 1.0625 1.0381 1.0621 1.0702 1.0884 1.0958 1.1030 1.0935 1.1034 1.0571 1.0990 1.0986 1.1122
irintensity: 0.5712 1.1794 1.4581 0.2978 0.6820 2.8293 1.4032 7.8215 0.5437 2.2673 0.6469 5.0925 4.2437 3.8720 25.0081 76.3915 24.7178 5.9286 1.8228 1.3142 8.3343 3.3759 0.2063 6.0905 14.6414 3.5307 16.4524 5.2563 14.8165 9.2769 32.3242 12.6977 36.0272 8.8939 1.0221 17.2800 9.1363 7.1812 1.5881 16.7935 6.7190 1.8055 8.7108 1.3212 0.7022 4.0486 26.6618 14.3448 9.1802 3.5677 11.3544 18.5656 5.3824 5.1830 9.0357 2.5608 84.3654 45.8874 4.3801 31.5754 35.3416 35.6681 55.0598 48.8470 45.2090 25.1016 18.9439 83.6909 23.2636 40.4862 42.1797 16.5507
temp: 298.150 k
press: 1.00000 atm
elementType: 17 7 6 6 6 6 6 6 6 6 1 1 1 1 1 1 1 1 1 1 1 1 1 1 1 1
symmnumber: 1
zpe: 603229.1 jmol-1
zpe.correction: 0.229758 hartree
zpe.thermalcorrener: 0.240876 hartree
zpe.thermalcorrenthalpy: 0.241821 hartree
zpe.thermalcorrgfe: 0.192304 hartree
zpe.sumelectzpe: -828.423008 hartree
zpe.sumelectthermal: -828.411890 hartree
zpe.sumelectthermalent: -828.410946 hartree
zpe.sumelectthermalfe: -828.460462 hartree
dipole: 3.2500 0.0414 -0.1058
dipole: 3.2520
quadrupole: -82.0299 -67.8526 -69.4272
quadrupole: 0.4755 -0.5106 0.9704
quadrupole: -8.9266 5.2506 3.6760 0.4755 -0.5106 0.9704
hfenergy: -828.6527662 hartree
pointgroup: C01 [X(C8H16Cl1N1)]
dipole: -1.273479 -0.012532 -0.1226031 debye
dipolederiv: -0.9045979 0.0008709 -0.0449773 0.1011276 -0.208632 -0.0067733 0.0837211 -0.0098134 -0.2002987 -1.0194745 -0.0739904 -0.0715505 0.015463 -0.5603 -0.0265813 0.0181915 -0.012204 -0.5080056 0.4190006 0.2566033 -0.0153712 0.3231854 0.4758174 0.0751116 -0.2011724 0.0406823 0.2966848 0.0284255 0.0182012 0.015056 0.0095429 0.0519041 0.0139873 0.0084484 -0.0144164 0.0888243 0.0757752 0.0072316 0.0053728 0.0136435 0.0541796 0.051407 0.0420435 0.0475352 0.1079836 0.1458213 -0.1042501 0.1469914 -0.2288857 0.3541727 -0.0774462 0.1664757 -0.0535831 0.4682706 0.0232571 0.0153723 0.0228998 0.0082109 0.0805352 -0.00553 0.0232575 0.0247132 0.1217709 0.552246 -0.0489157 -0.0081731 0.1169755 0.0937209 0.0311169 0.1712121 0.0340827 0.2637399 -0.0658625 -0.0672739 -0.0023206 -0.1348422 -0.1267963 -0.1200827 -0.0115959 -0.1637302 -0.1010411 1.0776488 -0.0590044 -0.0022867 -0.2078958 0.1695335 -0.0163375 -0.1734433 -0.0343859 0.1410928 -0.0143289 0.0630056 -0.0923702 0.026267 -0.0715358 0.0813278 -0.0642496 0.0787425 -0.0859746 0.0595856 0.0194395 -0.0637223 0.0271117 -0.0001928 -0.121729 -0.0252752 -0.0720482 -0.1344751 -0.0909256 -0.1156933 0.0475087 -0.1351073 -0.0997389 0.0735861 0.0199782 0.0411756 0.0663355 -0.0137718 0.0483574 -0.0763765 0.053871 -0.0215966 -0.1206434 -0.1132934 -0.0055002 -0.2505558 -0.0838648 -0.1312692 0.045181 -0.1058551 -0.0500512 0.0385958 0.0181757 0.0190933 0.0500949 -0.1586052 0.0914804 0.0782991 0.1099041 0.0001326 -0.0287571 0.1079946 -0.0366418 0.0393502 0.0630272 -0.0459131 -0.038448 -0.0732636 -0.0033226 -0.0727162 -0.0977816 -0.0671473 -0.1374077 0.0042907 0.0691148 -0.0414703 0.0648418 -0.0866698 0.1199804 -0.0584833 0.1635864 -0.0427022 0.0279774 -0.05287 -0.0308735 -0.0357861 0.0138669 -0.0735554 -0.0103137 -0.1482973 -0.1015483 -0.0526258 0.0115538 0.0248432 -0.0120794 0.0676116 0.006913 0.0956424 -0.0331333 -0.175976 0.0392708 0.0059528 -0.0061645 0.019374 -0.1231579 0.0346908 -0.0195967 0.0649628 0.0573913 -0.0901279 0.1227597 0.0860507 0.085843 0.0482646 -0.0425408 0.0753216 -0.0397503 0.0393178 -0.0221582 -0.1450418 0.0308134 -0.1415558 -0.0754109 0.0329881 0.0239693 0.0615543 0.0636837 0.040232 0.0350145 -0.0823816 0.0692212 0.0396231 0.109883 -0.082357 0.0643098 -0.0484764 -0.013712 0.0630477 0.0120386 0.0140997 -0.1001754 0.0171971 0.0086589 0.0512724 0.0754527 -0.0265031 0.0162164 0.0614318 0.0165888 0.0782182 0.025908 -0.0055285 -0.0010589 -0.0935315 unknown
polarizability: 131.4467333|-1.8402394|92.5283269|0.0620568|-0.1700816|82.0377916 unknown
InChI: InChI=1S/C8H16ClN/c1-8-4-2-3-6-10(8)7-5-9/h8H,2-7H2,1H3
charge 0 multiplicity 1
26 atoms
Cl 4.330483 0.020776 0.28603
N  0.188782 0.036249 0.068599
C  -0.798678 -1.045676 0.358514
C  -2.105099 -0.403994 0.895455
C  -2.660214 0.68462 -0.053474
C  -0.290525 1.074336 -0.875228
C  -1.574127 1.745348 -0.34529
C  1.57534 -0.412843 -0.177252
C  -1.060781 -2.002153 -0.8418
C  2.516695 0.467657 0.656475
H  -0.361735 -1.652212 1.177374
H  -1.884505 0.056681 1.878072
H  -2.860261 -1.196569 1.061389
H  -0.484317 0.652892 -1.893848
H  0.506534 1.831993 -0.993788
H  -3.550718 1.159648 0.399978
H  -2.996903 0.227226 -1.005762
H  -1.937932 2.485838 -1.083521
H  -1.330422 2.290286 0.587489
H  1.864604 -0.363102 -1.250417
H  1.693736 -1.465006 0.139116
H  -0.116132 -2.439646 -1.214722
H  -1.715893 -2.835959 -0.528345
H  -1.552098 -1.487754 -1.686397
H  2.424344 1.535625 0.409788
H  2.382321 0.306139 1.735163
