program: Gaussian 09
title: 000103735
version: EM64L-G09RevD.01
frameworkgroup: C1[X(C11H20O2)]
method: RPBEPBE
basis: SDD
operation: Freq
keyword: #pfreq=noraman
keyword: PBEPBE/SDD
title: #p freq=noraman PBEPBE/SDD
converged: YES YES NO NO
title: Mulliken charges:
elementType: O O C C C C C C C C C C C H H H H H H H H H H H H H H H H H H H H
charge: -0.278707 -0.264907 -0.014133 -0.434466 -0.375881 -0.731822 -0.297481 -0.706167 0.170883 0.221570 -0.763147 -0.219243 -0.735171 0.197663 0.210699 0.221644 0.196039 0.198137 0.213639 0.213241 0.214603 0.238141 0.239045 0.217251 0.220815 0.210159 0.207681 0.240435 0.241804 0.253210 0.235295 0.224143 0.235026
chargesum: 0.00000
title: Mulliken charges with hydrogens summed into heavy atoms:
elementType: O O C C C C C C C C C C C
charge: -0.278707 -0.264907 0.183530 -0.002122 0.018295 -0.090339 0.179705 -0.057942 0.170883 0.221570 -0.073226 0.033966 -0.040706
polarizability: 1.77565850e+02 1.81912501e+00 1.03747855e+02 -8.44493947e+00 5.63461403e+00 1.11983964e+02
1716.lowfreq: -30.9485 -8.0677 -0.0008 -0.0008 -0.0005 3.7313 12.4132 20.5831 51.5223
frequency: -12.0926 19.1600 51.2842 67.8339 81.5597 113.5865 124.8556 128.6183 148.5685 153.9873 209.2014 223.0416 230.2571 232.4266 259.8289 307.8450 329.5724 356.1003 401.7575 423.6441 435.4171 472.7648 559.0515 640.9122 697.4859 746.5994 765.8048 791.7716 805.4415 891.0632 894.9233 915.6824 948.5121 959.9175 971.2590 1008.1776 1019.9856 1031.9751 1045.1648 1050.0617 1051.4050 1059.3706 1133.5351 1144.4191 1150.8548 1181.3736 1210.0777 1232.6777 1244.9681 1277.4778 1292.4599 1304.6588 1339.7352 1347.2891 1358.2225 1381.4757 1387.4348 1388.4263 1393.5185 1404.5181 1457.9841 1462.3098 1463.6631 1464.1260 1472.1508 1473.5353 1475.6072 1479.8255 1481.1307 1486.6445 1490.6604 1596.4613 1672.7099 2953.2413 2967.0800 2969.5099 2971.9456 2973.8091 2992.0995 2996.1700 3009.7986 3016.0510 3037.3926 3042.7648 3064.7100 3067.3359 3069.0563 3070.3418 3072.4156 3079.7643 3088.2489 3100.5669 3110.8529
redmass: 3.4345 3.2954 3.8926 3.6889 3.1202 1.0405 1.3267 1.2357 2.8064 3.1596 1.0828 2.4620 2.2778 1.6196 2.5099 4.0016 3.0289 2.2432 3.9213 2.8736 2.6296 3.7702 2.8274 3.3542 4.4279 2.2294 1.2510 1.7886 2.0327 3.2607 1.2638 2.3380 1.8248 1.3788 1.4777 1.6777 1.7249 1.8080 1.4315 1.6211 2.9892 2.6356 2.0817 1.9584 2.9839 1.9795 1.2198 3.0957 1.2874 1.1594 1.3037 1.3227 1.3415 1.5737 1.4095 1.4456 1.2446 1.2210 1.3315 1.2527 1.0455 1.0597 1.0501 1.0686 1.0544 1.0880 1.0456 1.0691 1.0648 1.0617 1.0736 11.3377 6.3815 1.0805 1.0593 1.0384 1.0373 1.0375 1.0368 1.0624 1.0644 1.0921 1.0957 1.1009 1.0999 1.0998 1.0994 1.0971 1.0992 1.1066 1.0946 1.0981 1.0925
irintensity: 0.6796 0.0045 1.4416 1.1495 0.7720 1.1780 0.8738 0.0808 2.8417 0.2971 0.0744 0.0191 0.7792 0.0917 0.4073 12.8505 2.7875 0.1385 5.3180 0.0697 1.9071 2.6140 6.2504 7.3335 25.3285 6.9621 2.0311 3.6334 0.5510 4.3016 16.0617 3.7414 32.1836 16.3000 0.9819 10.3342 19.1968 19.2285 0.3028 0.7089 5.6921 358.5349 5.3335 7.5371 103.1724 0.8256 0.3844 202.7425 2.8059 1.5127 2.6766 7.9115 0.2991 1.0691 5.8170 0.4864 13.3296 17.2779 15.3931 25.6628 1.1907 29.4889 21.5894 6.1750 2.5523 10.8480 21.4631 9.5392 4.3532 19.0658 3.6591 158.7085 50.1799 16.1377 26.3089 24.5246 61.6438 9.1008 17.5959 22.8502 36.4687 24.5881 17.7615 11.7546 11.1522 38.7464 101.1040 14.8966 84.9306 41.6078 9.6384 25.6600 25.2127
temp: 298.150 k
press: 1.00000 atm
elementType: 8 8 6 6 6 6 6 6 6 6 6 6 6 1 1 1 1 1 1 1 1 1 1 1 1 1 1 1 1 1 1 1 1
symmnumber: 1
zpe: 753222.5 jmol-1
zpe.correction: 0.286887 hartree
zpe.thermalcorrener: 0.302805 hartree
zpe.thermalcorrenthalpy: 0.303749 hartree
zpe.thermalcorrgfe: 0.242655 hartree
zpe.sumelectzpe: -580.555091 hartree
zpe.sumelectthermal: -580.539173 hartree
zpe.sumelectthermalent: -580.538229 hartree
zpe.sumelectthermalfe: -580.599322 hartree
dipole: 0.0017 0.9814 1.6337
dipole: 1.9058
quadrupole: -64.9389 -82.7452 -84.4591
quadrupole: 2.1977 1.6154 -2.1340
quadrupole: 12.4422 -5.3642 -7.0780 2.1977 1.6154 -2.1340
hfenergy: -580.8419778 hartree
pointgroup: C01 [X(C11H20O2)]
dipole: 0.0114604 -0.522086 0.5380268 debye
polarizability: 177.5933359|1.2648648|106.693292|8.5754172|-6.7034655|109.0110403 unknown
InChI: InChI=1S/C11H20O2/c1-5-9(3)7-8-13-11(12)10(4)6-2/h6,9H,5,7-8H2,1-4H3
charge 0 multiplicity 1
33 atoms
O  -0.371116 -0.050576 0.484455
O  -1.323442 1.227933 -1.21371
C  3.473194 0.153473 0.631952
C  1.99734 -0.213855 0.966819
C  3.895208 -0.22276 -0.817068
C  3.778356 1.645713 0.917045
C  0.964197 0.467474 0.066039
C  3.708062 -1.713655 -1.174073
C  -1.462621 0.412177 -0.264548
C  -2.7481 -0.191164 0.215012
C  -2.69333 -1.161361 1.377023
C  -3.876278 0.193499 -0.458193
C  -5.295012 -0.244981 -0.211925
H  4.101013 -0.45266 1.320341
H  1.787537 0.059533 2.019097
H  1.856939 -1.30852 0.892031
H  4.963435 0.047517 -0.940901
H  3.339152 0.406382 -1.54182
H  4.858518 1.853514 0.802735
H  3.23916 2.31336 0.218659
H  3.486696 1.926427 1.946449
H  0.959041 1.567071 0.171218
H  1.10452 0.227899 -1.003417
H  4.109228 -1.932067 -2.1807
H  2.642285 -2.006814 -1.171232
H  4.237241 -2.364075 -0.451679
H  -3.695849 -1.528778 1.650082
H  -2.05632 -2.030848 1.133997
H  -2.241327 -0.685136 2.265426
H  -3.726383 0.909448 -1.280394
H  -5.932182 0.629897 0.025445
H  -5.393765 -0.974097 0.608569
H  -5.720897 -0.697871 -1.128936
