program: Gaussian 09
title: 000103732
version: EM64L-G09RevD.01
frameworkgroup: C1[X(C10H22O2)]
method: RPBEPBE
basis: SDD
operation: Freq
keyword: #pfreq=noraman
keyword: PBEPBE/SDD
title: #p freq=noraman PBEPBE/SDD
converged: YES YES NO NO
title: Mulliken charges:
elementType: O O C C C C C C C C C C H H H H H H H H H H H H H H H H H H H H H H
charge: -0.440362 -0.438799 -0.014105 -0.382111 -0.459579 -0.070690 -0.056512 -0.445702 -0.739888 -0.728896 -0.711241 -0.340905 0.190356 0.219270 0.189466 0.197397 0.214109 0.205926 0.185419 0.192684 0.218746 0.216030 0.215637 0.212074 0.210233 0.217763 0.220922 0.203861 0.208512 0.244801 0.193139 0.229518 0.316237 0.326687
chargesum: 0.00000
title: Mulliken charges with hydrogens summed into heavy atoms:
elementType: O O C C C C C C C C C C
charge: -0.124125 -0.112112 0.176251 0.026626 -0.048072 0.135236 0.128907 -0.034272 -0.096147 -0.079977 -0.054066 0.081752
polarizability: 1.31823953e+02 1.47051520e+00 1.10230058e+02 -1.88925686e+00 -1.27647697e+00 1.04917031e+02
1716.lowfreq: -20.5099 -4.2658 -0.0006 -0.0003 0.0006 9.0707 13.3420 27.0151 63.0803
frequency: 6.6793 25.9420 62.8363 74.1809 85.7993 103.6515 159.3873 196.2422 203.5784 212.9165 218.0431 233.6140 246.4475 283.5803 292.0964 308.5683 343.8908 363.6057 381.2618 400.3147 461.9263 472.8752 540.1238 544.1420 761.3709 780.6180 798.6707 837.3229 871.1380 918.9761 925.8354 937.8159 950.2510 956.3289 975.4138 981.1206 1009.7839 1037.4185 1062.5723 1079.3059 1089.8461 1110.3016 1130.4677 1152.0183 1158.6108 1175.4150 1189.7369 1234.2210 1246.0054 1261.5041 1282.0899 1292.6160 1299.3780 1310.6383 1324.1314 1331.8616 1343.8777 1352.5450 1353.5178 1357.5281 1377.8346 1384.2423 1390.3761 1396.9068 1452.9204 1463.4182 1467.1799 1471.8957 1475.3073 1477.1507 1483.2678 1484.8038 1487.1398 1492.4106 2930.3645 2945.1743 2948.8836 2955.5000 2964.2982 2970.5666 2972.9921 2973.7995 2976.3176 3007.1777 3022.5461 3024.0290 3046.4583 3062.8761 3066.6882 3069.1122 3069.3690 3077.5629 3085.9402 3093.5693 3531.4308 3553.6703
redmass: 3.4732 3.8806 2.1841 3.1192 3.0447 2.7451 2.1096 1.5173 1.5801 1.3386 1.4835 2.3750 1.5564 1.0975 1.5222 2.1455 2.3760 2.4838 2.4028 2.4819 2.9833 3.1192 2.6289 2.2349 1.3013 1.7773 1.6267 2.2974 2.6767 1.2704 1.6656 2.3372 1.5940 1.4371 1.8471 1.8955 2.6974 3.3561 1.8317 1.5568 1.4443 1.8152 2.1524 1.4978 2.1975 1.6607 1.5853 1.5864 1.3413 1.3636 1.1568 1.1821 1.3176 1.3277 1.3904 1.3897 1.4829 1.4153 1.2576 1.3629 1.2061 1.2955 1.2091 1.2067 1.0817 1.0731 1.0486 1.0495 1.0679 1.0596 1.0732 1.0592 1.0689 1.0518 1.0822 1.0751 1.0657 1.0698 1.0680 1.0550 1.0365 1.0462 1.0369 1.0861 1.0921 1.0947 1.0990 1.0990 1.0991 1.0986 1.0989 1.0993 1.0954 1.0989 1.0656 1.0661
irintensity: 0.5525 1.8513 3.4319 2.2108 0.9220 0.3444 1.3020 0.0941 1.0401 0.3814 0.8644 1.7848 4.7564 164.7297 36.6957 72.6361 27.0046 6.3021 1.3546 7.3267 1.3718 11.7986 8.9099 3.8059 7.5070 2.9697 13.8727 7.2328 7.1308 4.8796 23.9161 63.9305 13.3466 7.3208 34.1302 4.7549 48.7041 10.9776 13.9443 19.7598 11.0428 2.2095 5.7939 9.4527 0.4208 2.4295 23.1321 11.4781 4.0206 13.7141 5.7141 3.3874 0.4982 0.3921 12.2548 1.8398 3.0227 4.4593 10.7773 20.8222 20.6748 8.0655 21.4311 20.1543 3.8336 7.0367 7.0750 2.8267 7.4561 4.5460 5.2650 2.0977 23.9456 25.8909 23.8891 12.2149 12.6070 62.6430 69.4768 23.4643 28.8178 40.2401 33.2941 10.6386 23.0152 35.3392 59.7307 2.8972 58.8796 72.3666 73.7554 44.3846 37.6545 22.1684 3.9732 5.9910
temp: 298.150 k
press: 1.00000 atm
elementType: 8 8 6 6 6 6 6 6 6 6 6 6 1 1 1 1 1 1 1 1 1 1 1 1 1 1 1 1 1 1 1 1 1 1
symmnumber: 1
zpe: 800033.4 jmol-1
zpe.correction: 0.304717 hartree
zpe.thermalcorrener: 0.320989 hartree
zpe.thermalcorrenthalpy: 0.321934 hartree
zpe.thermalcorrgfe: 0.258942 hartree
zpe.sumelectzpe: -543.664492 hartree
zpe.sumelectthermal: -543.648219 hartree
zpe.sumelectthermalent: -543.647275 hartree
zpe.sumelectthermalfe: -543.710266 hartree
dipole: -1.7852 0.3838 2.4346
dipole: 3.0433
quadrupole: -90.7575 -75.2740 -81.1465
quadrupole: 7.5669 -2.1092 -1.7036
quadrupole: -8.3649 7.1187 1.2462 7.5669 -2.1092 -1.7036
hfenergy: -543.9692081 hartree
pointgroup: C01 [X(C10H22O2)]
dipole: 0.7025017 0.1196568 -0.9621574 debye
polarizability: 131.8433388|-1.4209147|110.3001371|-1.8174077|1.0670263|104.827566 unknown
InChI: InChI=1S/C10H22O2/c1-8(2)10(12)5-4-9(3)6-7-11/h8-12H,4-7H2,1-3H3
charge 0 multiplicity 1
34 atoms
O  1.612089 -0.476656 1.742633
O  -3.675278 -2.329203 -0.157284
C  -1.930047 1.162872 -0.393896
C  -0.606828 0.997769 0.404242
C  0.517047 0.261684 -0.358992
C  1.839001 0.198318 0.437702
C  3.020397 -0.4744 -0.318022
C  -2.576054 -0.186507 -0.827827
C  -2.928796 2.045136 0.396096
C  3.298453 0.189533 -1.68961
C  4.297898 -0.457848 0.555037
C  -2.95222 -1.136549 0.324666
H  -1.684128 1.702823 -1.334458
H  -0.796168 0.483811 1.365957
H  -0.238692 2.009944 0.672942
H  0.207975 -0.775723 -0.611464
H  0.69494 0.780949 -1.321048
H  2.139181 1.220803 0.739924
H  2.7326 -1.535252 -0.500088
H  -1.888431 -0.720268 -1.518222
H  -3.497709 0.025136 -1.405104
H  -3.886192 2.153423 -0.14709
H  -2.513539 3.057236 0.558048
H  -3.150764 1.617917 1.39191
H  3.455186 1.279644 -1.572705
H  4.217254 -0.231623 -2.137335
H  2.475796 0.036781 -2.410375
H  4.675845 0.576886 0.666771
H  5.100272 -1.062355 0.093211
H  4.091238 -0.851578 1.564707
H  -2.052315 -1.440154 0.900835
H  -3.662067 -0.659573 1.019302
H  1.344013 -1.414002 1.555485
H  -3.120656 -2.778974 -0.844449
