program: Gaussian 09
title: 000103719
version: EM64L-G09RevD.01
frameworkgroup: C1[X(C11H16O)]
method: RPBEPBE
basis: SDD
operation: Freq
keyword: #pfreq=noraman
keyword: PBEPBE/SDD
title: #p freq=noraman PBEPBE/SDD
converged: NO YES NO NO
title: Mulliken charges:
elementType: O C C C C C C C C C C C H H H H H H H H H H H H H H H H
charge: -0.286581 -0.189778 -0.244923 -0.118555 -0.143155 -0.526723 -0.059069 -0.533627 -0.533712 -0.285316 -0.217780 -0.518301 0.240185 0.248555 0.230087 0.248056 0.248724 0.218778 0.220463 0.233222 0.229984 0.217321 0.218487 0.235219 0.227659 0.200426 0.208172 0.232180
chargesum: 0.00000
title: Mulliken charges with hydrogens summed into heavy atoms:
elementType: O C C C C C C C C C C C
charge: -0.286581 0.050407 0.003632 0.111533 0.104900 -0.059221 0.161395 -0.070421 -0.097903 -0.050097 0.009879 0.122477
polarizability: 1.31027458e+02 3.44316479e+00 1.08375949e+02 -2.49722378e+00 -3.01223627e+00 9.13038812e+01
1716.lowfreq: -13.3385 -0.0002 0.0005 0.0007 11.8433 15.4860 76.5030 94.8847 148.6498
frequency: 76.3179 94.8751 148.6268 193.0242 208.4973 237.1625 277.3964 351.0698 386.4414 433.7223 468.5332 515.8048 529.1866 675.4103 714.5502 743.1665 773.3707 782.2950 797.8466 820.6316 850.5497 906.8313 920.0529 934.0801 944.1213 947.9097 956.5964 965.6360 978.6140 1011.3664 1031.2888 1039.0537 1046.9262 1065.0645 1085.7327 1100.8816 1113.0425 1116.6928 1127.7789 1140.9000 1161.6383 1169.1374 1193.1355 1205.3828 1246.0638 1254.6096 1267.1504 1271.7779 1285.1424 1288.2813 1299.4903 1305.9205 1319.1214 1340.0072 1343.0431 1434.1915 1456.6849 1462.6294 1466.2469 1477.2590 1482.2028 1632.1928 2922.2519 2927.4746 2958.3219 2999.7004 3000.8037 3006.7001 3008.2184 3012.5207 3033.3969 3048.8563 3060.4387 3076.6764 3079.2699 3098.2476 3122.1548 3157.6920
redmass: 3.1114 2.7023 1.8419 1.5729 2.9963 3.0277 2.6226 2.4627 2.3416 3.0467 2.2351 3.7594 4.2160 2.0196 1.9998 3.4539 3.1740 3.3629 3.3454 3.0886 2.2560 2.5103 2.5204 3.1398 1.3821 1.8484 1.8127 2.0904 2.0793 1.9488 1.7012 2.2299 2.3140 2.5727 1.5898 1.1243 1.1254 1.2731 1.4900 1.1897 1.5973 1.7597 1.4299 1.6266 1.5136 1.5093 1.3487 1.3621 1.4853 1.4857 1.5146 1.5384 1.5778 1.3523 1.7560 1.1343 1.0601 1.0866 1.0923 1.0522 1.0949 6.2816 1.0666 1.0515 1.0617 1.1011 1.0968 1.0615 1.0850 1.0614 1.0886 1.0870 1.0921 1.1035 1.1044 1.0975 1.0853 1.1064
irintensity: 0.6476 2.5319 4.3820 1.9196 0.4845 7.7322 1.1509 0.9516 0.3775 0.4885 2.4917 7.2967 0.6275 29.2218 22.8195 7.3581 3.9351 4.1928 2.8534 5.0246 4.1474 2.8535 1.5303 9.0129 0.3496 7.3749 11.5278 2.9543 4.4135 3.4827 1.4309 27.7315 25.3512 43.5056 8.9293 0.4478 3.7936 0.2962 8.3888 3.9773 3.1909 19.5402 2.2939 3.2297 4.3569 4.9570 1.1580 2.3463 3.1213 2.7119 2.5581 0.8772 1.3609 26.8090 3.1821 4.8327 7.1933 15.0168 6.0092 9.9051 12.8509 4.0904 34.4815 108.8921 45.7550 52.7735 30.7011 45.0290 7.4867 39.4149 55.6271 88.9061 7.2823 18.8326 46.0750 34.0823 7.5611 40.7234
temp: 298.150 k
press: 1.00000 atm
elementType: 8 6 6 6 6 6 6 6 6 6 6 6 1 1 1 1 1 1 1 1 1 1 1 1 1 1 1 1
symmnumber: 1
zpe: 642305.4 jmol-1
zpe.correction: 0.244641 hartree
zpe.thermalcorrener: 0.254961 hartree
zpe.thermalcorrenthalpy: 0.255905 hartree
zpe.thermalcorrgfe: 0.209088 hartree
zpe.sumelectzpe: -503.024171 hartree
zpe.sumelectthermal: -503.013851 hartree
zpe.sumelectthermalent: -503.012907 hartree
zpe.sumelectthermalfe: -503.059724 hartree
dipole: -0.1768 -0.1630 1.3523
dipole: 1.3735
quadrupole: -70.1823 -70.0692 -74.2727
quadrupole: 3.5137 -3.7544 -0.7576
quadrupole: 1.3258 1.4388 -2.7646 3.5137 -3.7544 -0.7576
hfenergy: -503.2688119 hartree
pointgroup: C01 [X(C11H16O1)]
dipole: 0.0660839 -0.0658867 -0.5322714 debye
polarizability: 130.4069526|-5.073759|108.9696596|-2.1900583|3.2816782|91.3306764 unknown
InChI: InChI=1S/C11H16O/c1-12-11-6-7-5-10(11)9-4-2-3-8(7)9/h2,4,7-11H,3,5-6H2,1H3
charge 0 multiplicity 1
28 atoms
O  2.425405 -0.440838 0.721417
C  -0.334643 1.634944 0.022183
C  0.492119 -0.25976 -0.957148
C  -1.036579 0.502718 0.831859
C  -0.430352 -0.814634 0.180659
C  -0.268664 1.020623 -1.409013
C  1.751685 0.384042 -0.288306
C  1.173187 1.656011 0.414009
C  -2.587623 0.412023 0.639024
C  -1.647048 -1.579772 -0.303014
C  -2.811015 -0.922712 -0.058355
C  3.106515 -1.600143 0.147137
H  -0.835146 2.614299 0.107685
H  0.720947 -0.992261 -1.749493
H  -0.781431 0.578057 1.903841
H  0.175784 -1.400747 0.897066
H  -1.256601 0.796351 -1.845954
H  0.306287 1.642212 -2.120464
H  2.489831 0.650399 -1.078761
H  1.671117 2.574542 0.056933
H  1.330744 1.57969 1.504203
H  -2.973339 1.256307 0.02973
H  -3.127446 0.458263 1.605675
H  -1.570149 -2.555133 -0.79769
H  -3.809396 -1.290904 -0.321536
H  3.819631 -1.29525 -0.649378
H  2.391077 -2.333282 -0.280868
H  3.660806 -2.072644 0.973657
