program: Gaussian 09
title: 000103723
version: EM64L-G09RevD.01
frameworkgroup: C1[X(C15H26O2)]
method: RPBEPBE
basis: SDD
operation: Freq
keyword: #pfreq=noraman
keyword: PBEPBE/SDD
title: #p freq=noraman PBEPBE/SDD
converged: YES YES NO NO
title: Mulliken charges:
elementType: O O C C C C C C C C C C C C C C C H H H H H H H H H H H H H H H H H H H H H H H H H H
charge: -0.437297 -0.270289 -0.032122 -0.376861 -0.412460 -0.394579 -0.030694 -0.515469 -0.745932 -0.714798 -0.717397 -0.143479 -0.326439 0.466868 -0.843961 -0.434395 0.148303 0.198537 0.185456 0.204167 0.204056 0.212845 0.196898 0.190867 0.197950 0.205367 0.219521 0.213642 0.215101 0.220033 0.215625 0.206459 0.211738 0.212330 0.211639 0.211300 0.247026 0.222483 0.303171 0.226460 0.229664 0.244409 0.374255
chargesum: 0.00000
title: Mulliken charges with hydrogens summed into heavy atoms:
elementType: O O C C C C C C C C C C C C C C C
charge: -0.063042 -0.270289 0.166415 0.012762 0.004442 -0.006814 0.167255 -0.090581 -0.097156 -0.080976 -0.082128 0.103547 -0.103955 0.466868 -0.084666 -0.189985 0.148303
polarizability: 2.24939674e+02 4.61797494e+01 2.04941330e+02 -1.33672490e+01 6.70328045e+00 1.30300530e+02
1716.lowfreq: -7.9265 -3.6252 -0.0005 -0.0001 0.0004 4.8976 9.5021 18.0375 33.1204
frequency: 9.3228 17.8154 32.8537 56.0995 63.7522 76.8521 83.3793 96.5436 101.0658 129.5813 145.0258 151.7228 204.9318 209.2192 217.3440 231.9343 232.8643 242.6268 247.4732 294.8755 332.6616 350.6505 353.2668 359.8970 388.9208 417.1412 431.3182 501.3089 541.4181 554.2607 583.5970 589.0759 660.2218 700.2802 731.7116 770.0274 802.2755 810.7288 831.8236 848.8678 887.0028 909.0357 916.2882 931.6522 937.3164 949.7949 958.7545 976.2675 979.1131 990.2352 1013.3644 1019.2026 1041.5166 1046.2671 1057.2473 1066.3854 1092.7534 1115.7698 1139.0679 1162.7879 1184.4469 1191.8613 1213.0849 1220.0497 1242.8519 1249.6648 1278.9426 1284.8089 1292.0872 1298.0083 1305.6846 1320.4383 1329.4304 1337.0196 1346.6119 1353.7416 1359.6502 1378.1338 1382.2367 1387.8927 1395.3829 1401.7514 1454.5509 1458.3717 1461.2281 1465.0250 1465.2663 1473.4532 1476.0479 1477.8278 1484.1264 1484.8054 1489.4054 1491.3420 1612.4869 1622.9096 1647.8402 2943.7387 2947.1128 2955.8524 2961.1603 2963.2662 2969.5366 2970.1677 2971.5529 2974.6308 2980.4262 2995.1226 3006.3881 3033.4234 3040.8202 3054.5662 3063.2070 3064.4088 3064.6724 3068.3508 3069.0037 3070.9818 3081.7650 3104.6659 3125.4131 3142.6792 3524.6136
redmass: 4.7105 3.7782 2.8342 4.2365 3.7773 3.7186 3.2494 2.5658 2.1403 2.8036 1.0468 2.4538 1.2656 1.1747 2.5068 1.7960 1.2563 2.8824 4.1638 2.8400 3.0249 2.6012 2.0173 3.7594 2.9441 3.0531 2.2951 2.2621 3.2980 2.3939 1.4018 1.9184 3.7421 3.7038 1.1426 2.8949 2.4686 1.6026 1.8247 2.7524 1.7122 1.6746 1.2809 1.9334 2.9173 1.5430 1.6829 1.5242 1.2327 2.0358 1.7850 1.7534 1.6764 1.5529 1.9840 2.1868 1.7542 1.5420 2.1108 2.3747 1.6076 1.9130 1.3727 1.3754 1.3654 1.3693 1.4211 1.4580 1.2073 1.4262 1.3222 1.5966 1.5467 1.4538 1.5412 1.5036 1.4480 1.2168 1.3053 1.2198 1.2181 1.5484 1.0749 1.0867 1.0806 1.1062 1.0554 1.0519 1.0618 1.0874 1.0536 1.0495 1.0564 1.0482 6.1349 6.1928 6.1488 1.0646 1.0703 1.0604 1.0752 1.0733 1.0357 1.0595 1.0369 1.0409 1.0392 1.0965 1.1016 1.0948 1.1029 1.0961 1.0994 1.0996 1.0995 1.0990 1.0990 1.0984 1.0916 1.0878 1.0977 1.0901 1.0640
irintensity: 0.0450 0.1190 0.0827 0.1744 0.2750 0.3009 1.4649 0.0881 0.0549 0.0593 0.8271 0.1196 0.0204 0.0807 0.2899 0.4047 0.3802 1.1654 1.4285 0.3239 0.1539 1.8228 0.0489 5.3928 1.1913 0.6045 1.1424 9.0325 40.0289 4.4576 109.8700 35.7752 4.5629 26.5693 6.4167 1.5876 0.4179 17.3539 4.1883 4.5726 19.9607 11.1353 8.7923 5.0050 26.7168 2.6552 0.6230 25.3888 48.3375 5.9083 8.8387 153.7646 10.4628 0.8715 273.6032 70.3530 6.4813 1.6630 8.0597 13.1444 3.3780 7.4332 1.8413 6.3192 10.2363 6.9985 22.0824 2.1321 5.1547 8.1836 1.1616 6.5284 7.5633 3.7136 1.7261 10.6950 6.0041 21.9270 48.4979 14.7987 13.8845 29.0847 3.9394 3.7942 24.8417 47.8267 18.3665 10.4546 3.1810 1.8462 1.8128 32.9851 18.3690 20.1972 116.2464 482.5265 27.8096 13.0766 15.8830 6.0476 45.0050 39.8789 40.7709 58.5587 48.3977 22.2486 20.3121 18.1244 2.9312 40.5950 98.8302 16.1325 13.6824 12.3448 64.4107 71.6402 58.4839 101.3340 10.8752 29.2461 1.1006 8.0008 51.1195
temp: 298.150 k
press: 1.00000 atm
elementType: 8 8 6 6 6 6 6 6 6 6 6 6 6 6 6 6 6 1 1 1 1 1 1 1 1 1 1 1 1 1 1 1 1 1 1 1 1 1 1 1 1 1 1
symmnumber: 1
zpe: 987281.4 jmol-1
zpe.correction: 0.376036 hartree
zpe.thermalcorrener: 0.397323 hartree
zpe.thermalcorrenthalpy: 0.398267 hartree
zpe.thermalcorrgfe: 0.322729 hartree
zpe.sumelectzpe: -736.267445 hartree
zpe.sumelectthermal: -736.246157 hartree
zpe.sumelectthermalent: -736.245213 hartree
zpe.sumelectthermalfe: -736.320751 hartree
dipole: 2.9971 1.1615 -0.6624
dipole: 3.2818
quadrupole: -117.4521 -100.3787 -108.5854
quadrupole: 3.4403 2.9000 -0.9150
quadrupole: -8.6467 8.4267 0.2200 3.4403 2.9000 -0.9150
hfenergy: -736.6434807 hartree
pointgroup: C01 [X(C15H26O2)]
dipole: -1.1917414 -0.4373748 -0.2357117 debye
polarizability: 227.3936938|46.0591439|201.9168343|10.7296051|-10.2651922|130.871005 unknown
InChI: InChI=1S/C15H26O2/c1-12(2)7-5-8-13(3)9-6-10-14(4)11-15(16)17/h6,10-13,16H,5,7-9H2,1-4H3
charge 0 multiplicity 1
43 atoms
O  4.655201 2.396325 -0.569572
O  5.202919 0.587638 0.780053
C  -2.119986 -2.446497 -0.203008
C  -2.370837 -1.237726 0.737437
C  -2.780523 0.069707 0.02116
C  -3.165619 1.186564 1.020051
C  -3.540299 2.56075 0.392818
C  -0.947485 -2.197208 -1.211549
C  -1.908461 -3.745026 0.61298
C  -2.349297 3.212702 -0.351597
C  -4.783749 2.468597 -0.525253
C  0.392556 -1.941077 -0.565629
C  1.150007 -0.819628 -0.768619
C  2.462946 -0.549895 -0.162885
C  3.068615 -1.579378 0.770279
C  3.077362 0.645834 -0.487321
C  4.377488 1.127039 -0.007261
H  -3.030834 -2.585498 -0.824926
H  -3.170108 -1.51678 1.455702
H  -1.458787 -1.052325 1.342327
H  -3.632959 -0.141379 -0.656224
H  -1.945672 0.419484 -0.616495
H  -2.319291 1.339683 1.722632
H  -4.020401 0.833049 1.634804
H  -3.80373 3.22854 1.241232
H  -0.869387 -3.101397 -1.853006
H  -1.205948 -1.354944 -1.880561
H  -1.711211 -4.610764 -0.047136
H  -1.057969 -3.650646 1.314037
H  -2.805656 -3.97706 1.216035
H  -1.455362 3.273113 0.297472
H  -2.074304 2.637863 -1.255939
H  -2.603037 4.238919 -0.676971
H  -4.573381 1.865066 -1.427918
H  -5.638194 2.004008 0.00235
H  -5.098476 3.473429 -0.863937
H  0.77008 -2.727338 0.103621
H  0.761576 -0.042208 -1.444189
H  4.038563 -1.243466 1.162019
H  2.387688 -1.776949 1.619703
H  3.211361 -2.54004 0.239974
H  2.571642 1.335903 -1.172345
H  5.539759 2.699216 -0.228545
