program: Gaussian 09
title: 000103781
version: EM64L-G09RevD.01
frameworkgroup: C1[X(C18H25N3O4)]
method: RPBEPBE
basis: SDD
operation: Freq
keyword: #p
keyword: freq=noraman
keyword: PBEPBE/SDD
title: #p freq=noraman PBEPBE/SDD
converged: YES YES NO NO
title: Mulliken charges:
elementType: O O O O N N N C C C C C C C C C C C C C C C C C C H H H H H H H H H H H H H H H H H H H H H H H H H
charge: -0.250596 -0.294364 -0.202020 -0.205921 -0.235690 -0.121970 0.017652 -0.087838 -0.441440 -0.488021 -0.562628 0.285274 0.332950 -0.006154 -0.570024 -0.515038 0.198674 0.381044 0.233245 0.256461 -0.690160 -0.697087 -0.812097 -0.783844 -0.808575 0.248800 0.232270 0.232503 0.264893 0.244161 0.230253 0.249700 0.185218 0.244932 0.337792 0.275625 0.211695 0.202017 0.210818 0.272254 0.211376 0.242801 0.230886 0.280017 0.212448 0.247621 0.260801 0.273245 0.239871 0.226167
chargesum: 0.00000
title: Mulliken charges with hydrogens summed into heavy atoms:
elementType: O O O O N N N C C C C C C C C C C C C C C C C C C
charge: -0.250596 -0.294364 -0.202020 -0.205921 -0.235690 -0.121970 0.017652 0.160962 0.023333 0.021034 -0.082674 0.285274 0.332950 0.179065 -0.325093 -0.177245 0.198674 0.381044 0.233245 0.256461 -0.000822 -0.002639 -0.058393 -0.062973 -0.069293
polarizability: 3.10625015e+02 -1.60736436e+01 2.44969487e+02 -2.15495755e+01 -1.68059868e+01 1.65957669e+02
1716.lowfreq: -6.5833 -4.1723 0.0002 0.0005 0.0010 3.4573 18.9695 23.1995 31.6037
frequency: 18.4740 22.4053 31.5598 42.7869 46.9340 67.2602 72.3096 94.2570 114.4223 125.0867 134.8615 139.1286 159.8497 168.8813 201.7459 210.8075 215.9774 219.5353 225.4566 229.6675 232.9613 248.7298 287.3380 305.4425 318.4131 322.9550 342.4290 361.4614 368.1712 393.2932 419.4930 426.8449 443.6025 448.4564 463.0362 472.4185 520.2220 545.2545 562.6905 569.7986 584.9467 586.4626 600.3876 636.4259 661.2005 682.0846 700.2943 713.5958 720.3198 734.6867 776.1185 816.0931 853.6827 865.8813 877.9952 905.8761 918.2132 920.6317 924.1113 943.1278 964.8191 966.4477 999.5745 1008.0393 1022.4590 1026.7579 1030.0006 1032.1045 1041.9556 1077.3984 1091.5150 1124.6017 1137.2949 1143.6115 1155.7610 1174.6554 1188.1461 1197.3019 1205.8355 1207.7070 1221.6978 1233.5881 1261.7194 1281.6758 1282.3640 1309.5417 1315.5092 1330.2871 1334.3090 1344.6537 1357.8153 1364.3898 1371.5635 1373.4773 1373.7461 1378.6337 1387.2936 1391.4832 1408.4234 1416.1675 1428.9492 1445.7786 1453.5210 1454.0357 1454.9627 1455.8993 1464.0490 1468.6756 1470.8059 1473.1091 1480.8719 1482.4364 1490.7324 1494.4839 1499.3409 1565.3492 1587.6171 1593.2281 1623.5883 2970.2229 2980.2695 2982.3635 2985.4446 2986.3472 2990.9263 2993.0188 2993.9992 3003.3300 3031.6959 3065.6313 3071.7625 3073.2765 3077.9991 3079.1732 3081.0821 3086.5018 3092.7254 3103.8520 3114.4793 3119.2851 3120.2711 3128.0357 3128.9414 3220.3714
redmass: 5.7660 4.0111 11.7144 4.2261 4.2465 4.7597 3.7750 3.8856 3.2250 4.9089 3.9036 1.9189 3.6314 1.4645 1.4761 1.5686 1.6260 1.3610 1.8393 1.3929 1.3973 3.4053 4.2824 4.4757 3.1437 3.9558 3.9301 2.6402 3.3391 5.1327 3.8201 4.6844 3.5396 2.4963 3.4134 3.2539 3.8821 4.4721 3.5376 3.7682 3.3572 4.7762 4.5007 3.5991 3.3498 3.6964 4.5760 6.2114 4.1288 3.8581 5.3421 2.5289 2.8127 2.8362 1.4328 1.6365 1.8935 1.2816 2.3884 1.4716 2.8721 1.9318 1.7703 1.5954 2.0005 1.7854 1.6905 1.9133 1.5355 2.4940 2.2969 2.4827 2.5546 2.3684 2.2998 2.3743 1.4091 2.0905 3.3867 8.4871 1.9897 1.4712 2.8844 2.0487 1.4179 1.4839 1.4543 1.6843 1.7221 1.5881 3.4421 1.3808 1.2225 1.9342 1.3021 2.0028 1.2244 1.3800 1.3824 4.2445 1.9042 1.0909 1.0705 1.0713 1.0608 1.0776 1.0953 1.0740 1.1873 1.0643 1.0527 1.0531 1.3189 1.9450 1.0642 7.0533 5.5352 7.5205 7.5379 1.0712 1.0630 1.0572 1.0440 1.0389 1.0383 1.0539 1.0365 1.0639 1.0935 1.1024 1.0995 1.0983 1.0975 1.0991 1.0963 1.0846 1.1011 1.0897 1.0991 1.0988 1.0911 1.0973 1.0977 1.0912
irintensity: 0.7583 1.3816 0.2728 5.0588 0.1777 3.7211 1.1656 3.1217 2.2995 0.3936 0.2185 0.6732 0.3457 0.1470 1.8100 1.4747 0.6522 1.9084 1.7216 0.4365 0.6445 11.9853 2.5358 0.7919 4.1715 0.5795 0.4494 1.2795 0.9102 0.8984 1.1681 1.7593 7.6624 2.8386 2.3364 4.6371 7.9292 1.4788 1.6531 5.5821 15.6309 18.6452 5.5445 1.5091 8.5338 6.2584 9.5576 4.0746 1.7706 10.5231 10.0950 5.9977 3.2724 1.6231 3.8556 17.7571 18.8075 3.1604 9.3632 0.1262 5.6345 1.7537 31.8207 7.5200 3.6762 2.4510 11.2930 6.3235 8.5823 8.0673 4.4655 23.8887 50.0493 9.6130 4.1431 16.2314 39.5513 8.3107 101.5084 240.8258 90.5565 77.7201 35.0115 204.2687 0.9391 10.1092 13.4775 14.8370 9.8213 82.1692 61.3890 26.7048 31.9151 76.7160 11.6517 55.5083 53.7141 49.5718 22.0720 11.9502 55.4768 31.7544 28.7028 20.0613 26.0719 6.1742 7.8115 26.3141 27.4771 24.1736 24.0714 5.5725 41.3108 107.5096 21.6708 48.4983 342.2940 66.9366 2.2048 18.9096 17.2544 28.1950 40.5353 13.7378 9.9029 35.7661 19.9228 19.6253 17.3413 36.3644 23.9627 17.0347 17.9734 53.1852 8.5239 2.2813 20.0375 24.5772 1.1754 15.0066 15.7477 7.7245 10.6092 13.4062
temp: 298.150 k
press: 1.00000 atm
elementType: 8 8 8 8 7 7 7 6 6 6 6 6 6 6 6 6 6 6 6 6 6 6 6 6 6 1 1 1 1 1 1 1 1 1 1 1 1 1 1 1 1 1 1 1 1 1 1 1 1 1
symmnumber: 1
zpe: 1073165.8 jmol-1
zpe.correction: 0.408747 hartree
zpe.thermalcorrener: 0.434573 hartree
zpe.thermalcorrenthalpy: 0.435517 hartree
zpe.thermalcorrgfe: 0.351713 hartree
zpe.sumelectzpe: -1164.120655 hartree
zpe.sumelectthermal: -1164.094829 hartree
zpe.sumelectthermalent: -1164.093885 hartree
zpe.sumelectthermalfe: -1164.177690 hartree
dipole: -4.7044 -2.0822 2.9811
dipole: 5.9460
quadrupole: -198.5369 -150.3739 -147.9049
quadrupole: -33.2726 7.5362 -0.7986
quadrupole: -32.9317 15.2313 17.7004 -33.2726 7.5362 -0.7986
hfenergy: -1164.5294023 hartree
pointgroup: C01 [X(C18H25N3O4)]
dipole: 1.8559173 0.8450649 1.146232 debye
polarizability: 309.2666914|-16.3701818|247.4296608|24.6951312|11.1768308|164.855819 unknown
InChI: InChI=1S/C18H25N3O4/c1-11(2)19(13(4)22)10-16-7-6-15-8-12(3)17(21(24)25)9-18(15)20(16)14(5)23/h8-9,11,16H,6-7,10H2,1-5H3
charge 0 multiplicity 1
50 atoms
O  -1.33897 -3.169717 0.531116
O  5.008403 1.880439 -0.742934
O  -4.429163 -1.37131 -1.871083
O  -5.700683 0.316403 -1.031527
N  -0.023145 -1.22357 0.540815
N  3.283907 0.325387 -0.571559
N  -4.576648 -0.313737 -1.144337
C  1.319821 -0.601647 0.74168
C  1.249096 0.434235 1.88537
C  1.856939 -0.048467 -0.620521
C  0.198178 1.52768 1.617402
C  -1.137328 -0.318251 0.398723
C  -1.051192 1.006029 0.92469
C  4.260545 -0.809973 -0.401008
C  -2.154818 1.875506 0.771468
C  -2.316237 -0.699979 -0.282609
C  -0.19668 -2.628747 0.580705
C  -3.364107 1.521906 0.130502
C  -3.394354 0.199528 -0.403463
C  3.765621 1.615472 -0.804849
C  5.083273 -0.684442 0.901817
C  5.157132 -0.989746 -1.648727
C  1.05632 -3.500414 0.688537
C  -4.482943 2.539927 0.045785
C  2.765666 2.716122 -1.171079
H  2.002715 -1.398981 1.068289
H  2.246982 0.885647 2.031339
H  0.994511 -0.109401 2.814383
H  1.25151 0.813367 -0.940098
H  1.709001 -0.84365 -1.380562
H  0.632855 2.332932 0.992876
H  -0.083657 2.01592 2.569064
H  3.628187 -1.717151 -0.321519
H  -2.069559 2.888936 1.183268
H  -2.419651 -1.694999 -0.71226
H  5.728054 0.207088 0.857139
H  5.720095 -1.579027 1.030084
H  4.425382 -0.600629 1.78683
H  4.545798 -1.095397 -2.563623
H  5.829607 -0.126526 -1.769594
H  5.768468 -1.903893 -1.536486
H  1.537374 -3.417733 1.680855
H  1.810659 -3.267306 -0.084476
H  0.726343 -4.54115 0.555812
H  -4.137867 3.511921 0.438114
H  -4.839722 2.679657 -0.98933
H  -5.365983 2.214159 0.621707
H  3.349426 3.632794 -1.339951
H  2.206601 2.47867 -2.094785
H  2.03354 2.913617 -0.368091
