program: Gaussian 09
title: 000103688
version: EM64L-G09RevD.01
frameworkgroup: C1[X(C12H14O3)]
method: RPBEPBE
basis: SDD
operation: Freq
keyword: #pfreq=noraman
keyword: PBEPBE/SDD
title: #p freq=noraman PBEPBE/SDD
converged: YES YES NO NO
title: Mulliken charges:
elementType: O O O C C C C C C C C C C C C H H H H H H H H H H H H H H
charge: -0.274777 -0.267239 -0.229463 -0.270406 -0.245229 0.498583 0.284780 -0.360635 -0.405804 -0.381970 -0.394433 0.437032 -0.228769 -0.804700 -0.670589 0.263098 0.265323 0.256300 0.233754 0.231230 0.231701 0.234462 0.230408 0.225822 0.227461 0.236616 0.213813 0.230584 0.233045
chargesum: 0.00000
title: Mulliken charges with hydrogens summed into heavy atoms:
elementType: O O O C C C C C C C C C C C C
charge: -0.274777 -0.267239 -0.229463 -0.007308 0.020094 0.498583 0.284780 -0.104335 -0.172051 -0.150740 -0.162732 0.437032 0.236102 -0.114801 0.006854
polarizability: 2.07386635e+02 -1.03621242e+01 1.10651356e+02 6.92498506e+00 1.49442661e+01 1.11410623e+02
1716.lowfreq: -3.1062 -1.9301 -0.0004 0.0004 0.0008 4.4926 18.3263 22.5332 37.1669
frequency: 15.1214 22.3549 37.0945 49.2473 66.6818 77.7477 126.4774 155.7836 169.2979 217.4049 247.0111 288.4218 291.3589 334.2751 365.1036 391.8712 406.0109 422.6740 521.2269 539.4381 632.3255 656.0189 705.6466 720.3283 749.9976 762.4293 797.9056 809.7530 814.0545 830.5866 849.3382 854.5289 932.0894 955.0484 973.8788 987.0810 1013.1811 1022.1681 1047.8170 1060.4466 1089.9252 1113.0637 1121.8415 1135.7873 1136.1989 1179.6801 1192.7298 1223.5859 1237.9946 1250.5000 1297.2468 1317.2094 1353.9747 1372.9164 1396.7105 1397.6867 1403.1473 1417.2786 1463.7659 1471.3775 1472.7603 1473.8879 1486.0407 1513.6821 1584.6565 1626.9270 1637.1898 2975.6243 2997.3245 3011.7981 3057.0117 3070.9482 3086.7782 3093.8417 3098.9750 3109.3208 3116.3080 3121.3187 3134.8791 3139.4982 3148.3230
redmass: 1.0489 3.4468 4.1779 2.6329 6.1968 3.2721 4.1968 3.0496 3.9892 4.1638 1.4761 3.6870 5.0868 3.6769 3.3564 5.0297 2.9017 4.0027 3.1186 4.4161 7.0199 7.2102 6.0214 3.8818 4.6784 4.2708 1.1230 3.2239 3.8645 2.3037 1.2532 3.9640 4.1525 1.4376 1.3768 1.4010 2.8790 2.3199 1.5646 1.3097 1.2522 2.3160 1.4028 1.4720 3.2899 2.1143 1.2087 2.7742 1.5554 1.1341 1.6017 1.3184 1.5513 3.1696 2.2564 1.4482 1.3348 2.5470 1.0398 1.0919 1.0634 1.0641 1.0664 2.8618 6.1303 6.3641 10.8095 1.0388 1.0359 1.0582 1.0948 1.1067 1.0998 1.0985 1.0899 1.1027 1.0872 1.0880 1.0903 1.0964 1.0965
irintensity: 0.3108 0.7391 1.1990 0.6049 0.8553 0.6542 0.1672 3.6423 2.7865 8.8536 0.2834 4.3232 2.8002 10.8389 3.4034 3.5119 0.3787 1.3213 18.9288 16.1926 0.4169 10.3601 7.2538 2.4745 32.7788 4.1014 2.3249 53.6282 0.8166 8.6262 0.6711 17.3217 27.6216 3.6706 0.2542 0.5336 8.2602 66.0747 17.4862 6.5389 2.9661 31.8091 32.0386 6.6268 416.4952 4.3922 3.4423 0.6023 3.6352 0.0618 30.0863 29.2757 12.0243 30.5095 62.8605 4.3889 15.7325 28.0867 12.2909 15.3908 4.6331 13.7054 14.2371 16.6388 0.5120 8.5833 170.8457 34.9352 20.8060 17.6444 23.0762 7.0630 17.5623 29.1636 4.5727 41.9679 11.3630 16.0789 6.9810 29.2387 3.7761
temp: 298.150 k
press: 1.00000 atm
elementType: 8 8 8 6 6 6 6 6 6 6 6 6 6 6 6 1 1 1 1 1 1 1 1 1 1 1 1 1 1
symmnumber: 1
zpe: 606799.4 jmol-1
zpe.correction: 0.231118 hartree
zpe.thermalcorrener: 0.246595 hartree
zpe.thermalcorrenthalpy: 0.247540 hartree
zpe.thermalcorrgfe: 0.184681 hartree
zpe.sumelectzpe: -690.197404 hartree
zpe.sumelectthermal: -690.181926 hartree
zpe.sumelectthermalent: -690.180982 hartree
zpe.sumelectthermalfe: -690.243841 hartree
dipole: -0.4836 3.1387 -1.8722
dipole: 3.6865
quadrupole: -65.2134 -93.4845 -87.7683
quadrupole: 5.0116 -0.3287 4.9922
quadrupole: 16.9420 -11.3291 -5.6129 5.0116 -0.3287 4.9922
hfenergy: -690.4285216 hartree
pointgroup: C01 [X(C12H14O3)]
dipole: -0.2489184 -1.2842903 -0.6262638 debye
polarizability: 208.2216894|7.1835548|96.7816453|3.3085685|-6.6294651|124.4452796 unknown
InChI: InChI=1S/C12H14O3/c1-3-14-12(13)11-10(15-11)9-6-4-8(2)5-7-9/h4-7,10-11H,3H2,1-2H3
charge 0 multiplicity 1
29 atoms
O  0.6702 1.757318 0.35086
O  3.305735 -0.590019 -0.373305
O  2.945456 0.29326 1.762528
C  0.03001 0.559795 1.016522
C  1.182258 0.370981 0.053772
C  -1.374226 0.223902 0.642287
C  2.543381 0.049249 0.602181
C  -1.922668 0.615514 -0.60551
C  -2.186138 -0.50259 1.547865
C  -3.248047 0.27352 -0.9392
C  -3.511464 -0.846714 1.20476
C  -4.064411 -0.47098 -0.045903
C  4.690632 -0.991454 0.035068
C  -5.481663 -0.861922 -0.426163
C  5.322468 -1.679939 -1.169251
H  0.294417 0.483618 2.080231
H  0.978418 0.01671 -0.96259
H  -1.31681 1.220582 -1.289817
H  -1.782494 -0.796771 2.524759
H  -3.662498 0.593149 -1.903201
H  -4.12654 -1.407453 1.918929
H  5.23439 -0.079124 0.339478
H  4.611641 -1.65581 0.914666
H  -6.109889 -1.028654 0.466197
H  -5.964328 -0.084226 -1.044243
H  -5.490162 -1.79988 -1.015115
H  6.351891 -1.99589 -0.920277
H  4.745863 -2.57426 -1.460895
H  5.368877 -0.997112 -2.034531
