program: Gaussian 09
title: 000103686
version: EM64L-G09RevD.01
frameworkgroup: C1[X(C14H11NOS)]
method: RPBEPBE
basis: SDD
operation: Freq
keyword: #p
keyword: freq=noraman
keyword: PBEPBE/SDD
title: #p freq=noraman PBEPBE/SDD
converged: YES YES NO NO
title: Mulliken charges:
elementType: S O N C C C C C C C C C C C C C C H H H H H H H H H H H
charge: 0.335755 -0.224474 -0.008208 0.477803 -0.246229 0.317556 -0.393749 -0.414373 -0.375430 -0.367478 -0.671423 0.182869 -0.293116 -0.276596 -0.197506 -0.139578 -0.516921 0.256677 0.257983 0.238203 0.269756 0.273733 0.236783 0.236496 0.234646 0.282881 0.252374 0.271566
chargesum: 0.00000
title: Mulliken charges with hydrogens summed into heavy atoms:
elementType: S O N C C C C C C C C C C C C C C
charge: 0.335755 -0.224474 -0.008208 0.477803 0.010448 0.317556 -0.135766 -0.176170 -0.105674 -0.093745 0.036502 0.182869 -0.293116 0.006285 -0.197506 0.112796 -0.245355
polarizability: 2.63155140e+02 6.72115426e+00 1.69929804e+02 4.40141213e+00 -1.69203245e+00 1.00172039e+02
1716.lowfreq: -7.9231 -3.6318 0.0020 0.0027 0.0029 4.4365 21.2382 37.6253 51.4448
frequency: 21.1733 37.5827 51.4235 67.2242 90.2769 135.1859 152.0426 177.2511 207.7488 213.3353 220.2405 245.5410 333.8758 340.1040 373.0879 406.9571 438.1834 464.3085 498.9004 539.7978 560.9474 576.3435 629.5155 636.3326 665.4425 691.2897 707.0606 723.0954 747.8019 764.7464 809.8917 847.8031 853.1396 860.7379 865.9281 866.9898 923.6316 975.6690 986.9222 990.0035 1013.0665 1052.8783 1055.9692 1082.8662 1087.8572 1124.9566 1134.2872 1195.4741 1202.5419 1222.9457 1250.4645 1288.7798 1292.9252 1317.1082 1341.1975 1379.7799 1388.7803 1409.7075 1452.9748 1468.1293 1475.5703 1497.9284 1513.1086 1534.7470 1578.2740 1617.6617 2194.8269 2992.2012 2998.3113 3103.6104 3108.6329 3123.3385 3134.9308 3157.7632 3162.3851 3176.3444 3193.6649 3233.3811
redmass: 4.8351 5.8029 6.1862 4.5871 7.6485 6.4937 5.7658 4.6721 3.7338 5.8802 1.3957 3.3192 6.5254 4.2879 6.3336 2.9029 6.1456 7.6179 5.1578 6.0119 3.4234 3.4135 7.0236 6.8358 5.6548 6.7203 4.2872 1.1773 4.0784 3.7227 4.7522 1.3671 2.5442 1.3031 2.6798 2.3158 1.3839 1.3524 1.4712 2.0195 2.9600 1.9183 1.9205 1.6401 1.3942 1.3993 2.5119 1.3027 1.5872 1.4685 1.4595 4.0137 1.5565 1.4144 2.3802 4.5769 1.1867 3.1002 6.7459 1.0447 1.0748 2.4210 7.8457 7.1094 7.2070 6.2293 12.5705 1.0822 1.0340 1.1015 1.1017 1.0895 1.0887 1.0950 1.0957 1.0897 1.0977 1.1002
irintensity: 6.2408 0.3311 0.9316 1.1527 2.8810 2.6606 0.7038 0.9928 1.5826 1.3022 0.3100 1.7253 4.7146 1.7679 0.5095 0.6881 2.2758 4.9920 5.3309 0.2751 6.1236 10.8385 0.8361 6.7522 4.1592 1.2533 32.0813 97.1344 26.0982 15.2780 47.2090 8.5619 27.5966 4.0221 3.3259 31.7996 0.2222 0.3025 10.9872 5.4509 7.4028 25.7285 9.9388 14.1465 23.8805 9.8783 10.0907 7.7621 10.6980 7.2856 1.5459 256.1597 2.5289 5.6507 21.4776 0.2785 9.4151 11.2789 118.0872 16.5161 6.8875 2.5478 84.5422 107.6088 15.9932 49.1312 9.0559 5.6758 20.1412 29.7902 17.2225 14.9195 5.8968 7.8829 1.4800 5.5200 1.7631 0.5320
temp: 298.150 k
press: 1.00000 atm
elementType: 16 8 7 6 6 6 6 6 6 6 6 6 6 6 6 6 6 1 1 1 1 1 1 1 1 1 1 1
symmnumber: 1
zpe: 545837.5 jmol-1
zpe.correction: 0.207899 hartree
zpe.thermalcorrener: 0.223428 hartree
zpe.thermalcorrenthalpy: 0.224373 hartree
zpe.thermalcorrgfe: 0.162929 hartree
zpe.sumelectzpe: -1066.915458 hartree
zpe.sumelectthermal: -1066.899928 hartree
zpe.sumelectthermalent: -1066.898984 hartree
zpe.sumelectthermalfe: -1066.960428 hartree
dipole: -0.3856 -1.2400 3.7471
dipole: 3.9657
quadrupole: -103.6074 -109.0341 -110.6764
quadrupole: 27.6358 11.3897 -2.7022
quadrupole: 4.1652 -1.2615 -2.9037 27.6358 11.3897 -2.7022
hfenergy: -1067.1233567 hartree
pointgroup: C01 [X(C14H11N1O1S1)]
dipole: 0.2396381 -0.8700168 -1.2727734 debye
polarizability: 262.8609585|0.8193972|165.1242554|11.8473416|-16.8806343|105.2717696 unknown
InChI: InChI=1S/C14H11NOS/c1-10(9-15)11-4-6-12(7-5-11)14(16)13-3-2-8-17-13/h2-8,10H,1H3
charge 0 multiplicity 1
28 atoms
S  4.586857 0.585282 0.430017
O  2.189691 2.340768 -0.154263
N  -4.809056 -1.65001 1.668968
C  -2.378685 0.140522 -0.222639
C  -3.878353 -0.166728 -0.348101
C  0.413088 0.712438 -0.147166
C  -1.494415 -0.69479 0.500467
C  -1.856009 1.277732 -0.89203
C  -0.111437 -0.415971 0.53515
C  -0.480743 1.566475 -0.847031
C  -4.195976 -0.877469 -1.704317
C  1.864342 1.109099 -0.098119
C  2.902218 0.066029 -0.001862
C  2.864299 -1.30461 -0.281648
C  -4.386554 -0.980157 0.776673
C  4.13305 -1.960785 -0.144224
C  5.15173 -1.095325 0.240051
H  -4.434275 0.792204 -0.328517
H  -1.88832 -1.553044 1.056573
H  -2.531899 1.945509 -1.440542
H  0.550044 -1.049954 1.134004
H  -0.073941 2.457802 -1.335415
H  -5.27996 -1.055255 -1.808715
H  -3.67057 -1.84519 -1.765423
H  -3.856433 -0.243811 -2.541221
H  1.956978 -1.814622 -0.611793
H  4.288333 -3.026704 -0.32553
H  6.200094 -1.325837 0.424455
