program: Gaussian 09
title: 000103673
version: EM64L-G09RevD.01
frameworkgroup: C1[X(C8H10N2)]
method: RPBEPBE
basis: SDD
operation: Freq
keyword: #pfreq=noraman
keyword: PBEPBE/SDD
title: #p freq=noraman PBEPBE/SDD
converged: NO YES NO NO
title: Mulliken charges:
elementType: N N C C C C C C C C H H H H H H H H H H
charge: 0.014468 -0.586089 0.441289 0.459443 -0.392553 -0.377105 -0.401310 -0.379941 -0.808475 -0.382635 0.225752 0.225394 0.217197 0.261064 0.223956 0.222495 0.233752 0.194620 0.282836 0.325842
chargesum: 0.00000
title: Mulliken charges with hydrogens summed into heavy atoms:
elementType: N N C C C C C C C C
charge: 0.014468 0.022589 0.441289 0.459443 -0.166801 -0.151711 -0.184113 -0.118877 -0.128271 -0.188015
polarizability: 1.97357449e+02 3.29145725e+00 9.87669533e+01 5.09961987e-01 -2.67496700e-02 4.44170103e+01
1716.lowfreq: -39.7377 -4.5925 -0.0008 0.0002 0.0005 4.6638 9.5866 76.6288 130.7830
frequency: -38.2262 76.6224 130.7790 150.7930 208.8783 316.2732 341.2609 341.5370 358.0648 408.9371 424.9026 519.3419 544.5114 576.5821 636.6012 725.8811 771.1551 824.2257 852.2153 857.2921 909.1988 956.3660 983.4921 985.3029 1008.8201 1045.1379 1096.7823 1127.7316 1176.8535 1188.6560 1222.9556 1241.6339 1309.4920 1361.5703 1395.2845 1402.0964 1413.3415 1471.1480 1472.1718 1510.1977 1566.8238 1589.0159 1623.0401 1653.7673 2964.8360 2970.7075 3051.1234 3081.2257 3107.6944 3117.7988 3133.6354 3158.5843 3427.6135 3680.8897
redmass: 1.0328 3.9785 3.9513 2.2479 4.1489 2.8347 1.8157 2.2198 3.3903 2.8904 3.4850 2.3452 1.2365 4.9720 6.9426 2.9158 4.2830 1.4143 1.2825 4.1507 1.4819 1.3892 1.3907 1.3791 2.8722 1.5566 3.4188 1.4787 1.3770 1.1412 2.7798 1.9328 1.3301 4.2630 1.2269 2.0457 3.1521 1.0978 1.0547 2.9241 6.4038 4.9336 6.3004 1.1699 1.0860 1.0390 1.0945 1.0996 1.0867 1.0891 1.0963 1.0949 1.0503 1.0956
irintensity: 0.6510 1.3193 6.1125 12.5835 2.9649 2.1827 200.8677 142.1460 21.5395 0.0552 6.3919 22.2066 1.2527 8.0306 0.2521 2.5886 1.8062 35.2874 8.0639 4.4409 40.9519 10.5178 1.8830 1.1583 1.5674 21.9060 100.9852 19.1101 44.4656 7.8643 0.6742 8.5784 0.7793 4.3870 6.8677 31.6176 6.8572 16.3309 12.5769 13.7131 56.9872 120.8497 5.0945 11.6620 80.4846 44.4717 26.0814 19.7477 16.8563 25.1855 32.0556 5.7306 20.0911 69.8231
temp: 298.150 k
press: 1.00000 atm
elementType: 7 7 6 6 6 6 6 6 6 6 1 1 1 1 1 1 1 1 1 1
symmnumber: 1
zpe: 427490.6 jmol-1
zpe.correction: 0.162823 hartree
zpe.thermalcorrener: 0.171913 hartree
zpe.thermalcorrenthalpy: 0.172858 hartree
zpe.thermalcorrgfe: 0.128795 hartree
zpe.sumelectzpe: -419.592826 hartree
zpe.sumelectthermal: -419.583736 hartree
zpe.sumelectthermalent: -419.582791 hartree
zpe.sumelectthermalfe: -419.626854 hartree
dipole: -1.6613 1.1160 0.0983
dipole: 2.0038
quadrupole: -37.4382 -53.5954 -64.9677
quadrupole: -3.0499 -0.0128 -0.0002
quadrupole: 14.5623 -1.5950 -12.9673 -3.0499 -0.0128 -0.0002
hfenergy: -419.755649 hartree
pointgroup: C01 [X(C8H10N2)]
dipole: -0.649771 0.4425655 0.058418 debye
dipolederiv: 1.4681646 0.2899404 -0.0450525 -0.040151 -0.3263508 0.0017588 -0.0411475 -0.0057406 -0.0764654 -1.6674389 -0.3122248 0.0212052 0.3371532 0.1267366 -0.0091676 0.0033308 0.0055505 -0.7613132 0.3370507 -0.0595299 0.0069617 -0.0432385 -0.0540463 -0.0016953 0.1029983 -0.0095368 -0.0463945 0.4561393 0.0126904 -0.0151686 0.0379613 -0.1225323 0.0001909 -0.0189637 0.0008357 0.0403273 -0.0618799 0.0648531 -0.0016333 0.2343636 0.055175 0.0003765 -0.0083937 0.0051169 -0.1688321 -0.1597721 -0.0173612 -0.0006418 -0.1667635 0.1213281 -0.0009143 -0.0091815 -0.0032625 -0.1708938 -0.1382247 -0.0310765 -0.0016359 -0.103044 0.0821718 -0.0012306 -0.0107004 -0.0015622 -0.1946275 -0.1193616 0.0326073 0.0008161 0.1322143 0.0262165 0.0012488 -0.008665 0.002739 -0.1518172 -0.1379942 0.03137 -0.0032152 0.0462923 0.0777263 -0.0006409 -0.1412355 0.0128256 0.0791948 -0.1594451 -0.0802456 -0.0023867 -0.7160271 0.3043234 0.018879 0.0019063 0.0002151 -0.1803326 -0.029931 -0.1197965 0.0080521 -0.1235426 -0.0421965 0.0012572 0.0116272 0.0058013 0.150556 0.0280715 0.0923461 0.0070366 0.1019957 -0.0976874 -0.0028282 0.0095544 -0.0078478 0.1465665 0.0391516 0.1038842 0.0042549 0.0776837 -0.0989376 -0.0021842 0.0072956 -0.0018668 0.1558709 0.0439035 -0.0901097 0.0030229 -0.0620627 0.001831 0.0004154 0.0063944 0.0003374 0.1537393 0.0208178 0.0126572 0.0114076 0.0973245 -0.078607 -0.1128253 0.081948 -0.0958747 0.0483536 -0.0150128 -0.0387182 0.038404 -0.1290591 -0.0556601 0.0970598 0.0964338 0.0672876 0.0611628 -0.0769614 0.023309 -0.06187 0.0297178 0.1068851 0.018646 -0.1282886 0.025113 -0.1022463 -0.0663885 0.07507 0.0081482 0.1177126 -0.1865768 -0.0017942 0.0088199 -0.0019754 0.192832 0.0450529 0.0070365 0.0136236 0.043508 -0.0140952 -0.0041809 0.0215507 -0.0016778 0.4125405 0.194058 0.0032983 0.0086711 0.1279615 0.1742964 -0.002371 0.0147167 0.0035228 0.4117788 unknown
polarizability: 197.2830453|2.7603683|98.7344648|-4.0748175|-0.0825928|44.5239029 unknown
InChI: InChI=1S/C8H10N2/c1-7-2-4-8(5-3-7)6-10-9/h2-6H,9H2,1H3
charge 0 multiplicity 1
20 atoms
N  -2.856362 -0.472308 0.142557
N  -4.191872 -0.189674 0.182374
C  2.30503 -0.128589 -0.027454
C  -0.539703 0.276317 0.06402
C  1.753329 1.177487 -0.008531
C  1.404011 -1.229358 -0.005483
C  0.357635 1.379252 0.037755
C  0.011121 -1.037678 0.041023
C  3.807924 -0.347825 -0.045128
C  -1.985824 0.520978 0.10879
H  2.424377 2.045161 -0.031401
H  1.807157 -2.249799 -0.026562
H  -0.042885 2.401308 0.049476
H  -0.673738 -1.891657 0.056057
H  4.076389 -1.27098 -0.589208
H  4.33574 0.495795 -0.524274
H  4.209999 -0.44583 0.982627
H  -2.31503 1.581116 0.114905
H  -4.567609 0.765179 0.204079
H  -4.819689 -0.985396 0.213079
