program: Gaussian 09
title: 000103712
version: EM64L-G09RevD.01
frameworkgroup: C1[X(C20H14Cl2N3O)]
method: RPBEPBE
basis: SDD
operation: Freq
keyword: #p
keyword: freq=noraman
keyword: PBEPBE/SDD
title: #p freq=noraman PBEPBE/SDD
converged: YES YES NO NO
title: Mulliken charges:
elementType: Cl Cl O N N N C C C C C C C C C C C C C C C C C C C C H H H H H H H H H H H H H H
charge: 0.014823 -0.020234 -0.188311 -0.083970 -0.088385 -0.418177 -0.252650 0.237945 0.012477 0.315613 0.125472 0.439702 -0.287267 -0.393117 -0.085372 -0.108088 -0.157971 -0.192389 -0.336469 -0.367691 -0.192026 -0.193842 -0.136209 -0.209525 -0.227713 -0.210504 0.298781 0.360468 0.293412 0.261948 0.285702 0.341786 0.281490 0.254421 0.276731 0.277770 0.286100 0.275125 0.252358 0.257784
chargesum: 1.00000
title: Mulliken charges with hydrogens summed into heavy atoms:
elementType: Cl Cl O N N N C C C C C C C C C C C C C C C C C C C C
charge: 0.014823 -0.020234 -0.188311 -0.083970 -0.088385 -0.057709 0.046130 0.237945 0.012477 0.315613 0.125472 0.439702 0.006145 -0.131169 0.200331 0.233698 -0.157971 0.089101 -0.336469 -0.113269 0.084705 0.083929 0.149891 0.065600 0.024646 0.047279
polarizability: 3.49083039e+02 3.60362407e+00 2.76273861e+02 8.85568567e+00 -2.13110558e+01 1.71288934e+02
1716.lowfreq: -9.3927 -3.8045 -2.9967 0.0021 0.0026 0.0030 17.6929 26.7630 31.4071
frequency: 17.3693 26.6933 31.2572 50.1306 53.8843 69.7123 75.0649 123.8005 129.0996 154.1447 176.1662 186.0226 209.4021 223.1877 253.9518 276.0558 301.2234 312.6986 323.7759 367.0561 382.1012 397.4988 408.6613 425.7809 435.1061 456.2776 467.7444 478.1752 509.5812 527.5189 537.6806 580.1492 613.7036 640.1899 644.1320 654.5986 665.9292 676.5192 692.2377 705.6820 719.9950 725.6237 751.3926 772.7892 774.6837 790.8825 829.3889 839.4363 869.7583 878.5671 881.3252 891.0471 901.0215 948.9158 962.1356 963.6996 965.3645 998.1743 1000.3129 1003.0551 1015.8946 1024.4934 1025.7476 1043.6980 1052.0735 1091.4657 1093.2458 1127.9695 1130.5934 1137.0301 1179.7961 1180.1568 1182.3571 1202.6454 1210.9179 1224.3970 1255.5603 1263.9256 1274.3524 1309.7430 1316.0399 1348.9208 1364.8441 1368.5693 1373.4539 1391.1231 1423.4915 1440.4990 1458.9518 1466.4481 1472.6823 1479.3259 1552.5693 1565.2756 1572.6640 1582.4297 1598.7000 1599.8185 1630.4120 1652.5958 2951.4683 3144.8337 3146.5954 3157.6857 3170.0232 3171.2887 3174.9022 3181.2210 3183.7220 3185.2503 3189.7167 3200.3234 3206.8333 3494.5356
redmass: 4.4001 7.4118 8.7206 7.1673 7.1437 7.2016 6.5504 8.9891 4.9541 7.3096 6.5924 6.4781 7.0060 6.2116 5.3615 6.8143 9.8280 7.2236 6.1333 6.7059 4.9495 2.7548 7.1151 8.8897 3.8055 4.3962 4.3195 4.4242 5.3061 4.2870 5.3043 4.1617 3.9462 5.5874 6.1615 5.2007 5.0049 5.0437 2.4384 4.2942 2.6205 2.9869 2.7182 1.9300 1.7332 3.4380 2.1170 2.4291 1.2637 1.9701 2.3564 4.1147 1.5612 5.2647 1.3649 1.4097 1.3766 1.7032 1.5536 2.7275 4.1019 4.2688 1.5399 2.2385 2.2633 2.0584 1.8176 1.7423 2.2709 2.7819 1.1010 1.9926 1.0719 1.7964 1.3757 1.5066 1.5434 1.5255 1.5245 2.9182 2.9729 1.2625 4.5056 4.4506 3.9471 6.2436 2.2445 2.0003 2.5706 2.2495 2.7284 2.1114 8.1873 6.1213 6.4301 8.5448 6.9532 6.7819 5.3776 6.6305 1.0829 1.0909 1.0872 1.0907 1.0926 1.0952 1.0906 1.0964 1.1005 1.0908 1.0950 1.0984 1.1031 1.0760
irintensity: 0.3708 0.1743 0.8634 0.1899 1.9300 3.7875 0.8531 1.4850 0.8720 5.7329 0.6656 0.6162 2.0888 7.4778 4.0973 0.9573 1.3659 1.6433 2.1019 2.5298 1.9240 0.7385 1.8274 6.9274 2.6910 4.4868 1.2411 14.8087 7.1945 11.7061 19.9484 34.0996 20.0226 3.8031 8.5546 4.7532 3.7384 0.4839 60.9938 2.5780 56.4556 25.1261 28.0682 43.2234 17.2193 38.4931 44.8186 11.4449 0.7288 8.0838 22.9856 26.8940 13.4289 13.8803 1.1858 2.1860 0.7521 9.3843 1.9560 11.5363 1.7731 43.1008 2.5528 9.5587 4.4076 70.0399 7.6667 2.0814 9.2031 90.5565 1.6177 8.5863 1.2948 37.6625 11.4242 20.9611 6.9112 4.9029 54.0492 41.6556 119.8147 5.4097 26.8753 22.6867 1.4333 2.8672 46.1525 5.1498 24.3344 41.2262 86.5630 46.3204 120.2478 14.1954 23.6317 102.1256 41.4227 4.8679 21.6551 531.4363 11.7689 2.7332 0.5921 4.2175 0.4427 4.2462 1.7894 0.1993 5.5528 5.0435 14.2890 14.1821 1.7099 63.3402
temp: 298.150 k
press: 1.00000 atm
elementType: 17 17 8 7 7 7 6 6 6 6 6 6 6 6 6 6 6 6 6 6 6 6 6 6 6 6 1 1 1 1 1 1 1 1 1 1 1 1 1 1
symmnumber: 1
zpe: 771416.8 jmol-1
zpe.correction: 0.293817 hartree
zpe.thermalcorrener: 0.315189 hartree
zpe.thermalcorrenthalpy: 0.316133 hartree
zpe.thermalcorrgfe: 0.240901 hartree
zpe.sumelectzpe: -1928.120153 hartree
zpe.sumelectthermal: -1928.098781 hartree
zpe.sumelectthermalent: -1928.097837 hartree
zpe.sumelectthermalfe: -1928.173069 hartree
dipole: 10.3618 -0.4422 -3.4500
dipole: 10.9300
quadrupole: -77.4508 -113.9830 -158.5596
quadrupole: -2.1516 -19.6992 -5.7794
quadrupole: 39.2137 2.6815 -41.8951 -2.1516 -19.6992 -5.7794
hfenergy: -1928.4139697 hartree
pointgroup: C01 [X(C20H14Cl2N3O1)]
dipole: 4.0114487 -0.1635955 1.5405016 debye
polarizability: 348.3793708|-9.51454|276.266661|-2.7484474|-23.9343616|171.999802 unknown
InChI: InChI=1S/C20H14Cl2N3O/c21-13-8-9-17-15(12-13)18(14-6-2-3-7-16(14)22)24-19(20(26)23-17)25-10-4-1-5-11-25/h1-12,19,23H
charge 1 multiplicity 1
40 atoms
Cl -4.718838 2.690602 1.435154
Cl -2.799008 -0.696189 -2.264582
O  2.722581 1.270438 -1.859004
N  2.955108 0.035892 0.564315
N  0.663644 -0.564054 0.149585
N  0.516483 1.946738 -1.506947
C  1.57259 0.558617 0.229554
C  -1.262033 0.998509 -0.009069
C  -0.637001 -0.351049 0.06066
C  -0.690756 2.078893 -0.755447
C  1.683033 1.290167 -1.153378
C  -1.513228 -1.559842 0.099839
C  -2.502115 1.209278 0.655968
C  -1.38336 3.312911 -0.850745
C  3.893376 0.925653 1.026075
C  3.279046 -1.264225 0.272962
C  -3.152387 2.447366 0.568551
C  -2.611568 3.506118 -0.195357
C  -2.545569 -1.809599 -0.843009
C  -1.304491 -2.528049 1.122093
C  5.211771 0.511682 1.245443
C  4.590678 -1.719158 0.476165
C  5.571743 -0.828851 0.966845
C  -3.359251 -2.954794 -0.768019
C  -2.115343 -3.675852 1.216584
C  -3.148716 -3.886032 0.273856
H  1.298583 1.297202 1.014255
H  0.585597 2.485166 -2.378445
H  -2.951856 0.392478 1.227304
H  -0.954962 4.13128 -1.440008
H  3.558879 1.949629 1.20632
H  2.451806 -1.8757 -0.093233
H  -3.138533 4.461284 -0.271292
H  -0.504444 -2.350384 1.848145
H  5.94195 1.232085 1.620527
H  4.832157 -2.758048 0.240559
H  6.599395 -1.16837 1.12504
H  -4.136019 -3.121189 -1.519445
H  -1.948042 -4.399785 2.019749
H  -3.785701 -4.773718 0.338435
