program: Gaussian 09
title: 000103659
version: EM64L-G09RevD.01
frameworkgroup: C1[X(C11H18O2)]
method: RPBEPBE
basis: SDD
operation: Freq
keyword: #pfreq=noraman
keyword: PBEPBE/SDD
title: #p freq=noraman PBEPBE/SDD
converged: NO YES NO NO
title: Mulliken charges:
elementType: O O C C C C C C C C C C C H H H H H H H H H H H H H H H H H H
charge: -0.272081 -0.234691 -0.282074 0.442712 -0.101206 -0.546163 -0.541652 -0.172994 -0.495927 -0.789708 -0.796350 0.169383 -0.506389 0.258034 0.230842 0.262338 0.221768 0.227428 0.202667 0.266098 0.237999 0.211917 0.213452 0.223026 0.212594 0.215576 0.215160 0.217620 0.231950 0.240672 0.238000
chargesum: 0.00000
title: Mulliken charges with hydrogens summed into heavy atoms:
elementType: O O C C C C C C C C C C C
charge: -0.272081 -0.234691 -0.024039 0.442712 0.129636 -0.062058 -0.111558 0.093105 -0.046010 -0.140636 -0.147994 0.169383 0.204233
polarizability: 1.40021482e+02 -3.05461029e-01 1.05657067e+02 -2.28241815e+00 1.28811121e+00 1.07917578e+02
1716.lowfreq: -17.5487 -8.0555 -5.3429 -0.0005 -0.0002 0.0004 8.6900 82.1500 96.1064
frequency: 4.9803 82.1423 96.0933 103.0419 131.0356 183.7549 216.8626 237.3075 256.1198 277.1948 291.7558 336.4815 364.2953 388.6082 403.2284 440.8936 470.1511 540.1784 642.2377 686.8372 714.7304 755.3123 779.2447 819.4995 832.3446 870.3862 892.8060 905.3378 921.9478 928.6568 941.7270 959.1321 961.9929 983.6608 993.2329 1003.7285 1019.6191 1056.0313 1091.7732 1106.4109 1111.3252 1117.6000 1135.5868 1147.2614 1156.5598 1188.4835 1195.7980 1220.6731 1242.1358 1243.4172 1262.9363 1275.9182 1283.7580 1303.9046 1304.9138 1342.5337 1380.3705 1397.9071 1420.5459 1452.0374 1464.4208 1464.6479 1466.7752 1471.4600 1479.0904 1482.4128 1494.9971 1500.7796 1637.5384 2966.9953 2971.3909 2985.5092 3001.8880 3007.1043 3027.1250 3042.6891 3053.3223 3054.7514 3057.8025 3061.8178 3066.9415 3069.9933 3075.8353 3077.6707 3095.9432 3102.2539 3145.7491
redmass: 5.3984 2.3882 1.4812 2.0559 2.8373 3.1329 1.6940 1.2302 4.7690 1.4287 2.8608 2.7951 3.0361 2.5939 1.9405 2.3805 2.0695 3.2065 5.4630 4.2087 3.8703 5.0190 4.1860 2.7750 2.3959 2.8596 2.1794 2.1453 2.2846 2.3555 1.5268 2.0881 1.8682 2.4929 1.4222 1.5442 1.8729 1.4447 1.3688 1.4261 1.2699 1.5861 1.5073 1.4765 2.1772 1.8688 1.9590 2.4380 1.6051 1.5190 1.4521 1.6249 1.8432 1.5339 1.5732 1.6131 1.2096 1.2003 1.1843 1.0505 1.0572 1.0510 1.0765 1.0564 1.0765 1.0624 1.0539 1.0930 8.9458 1.0358 1.0367 1.0597 1.0296 1.0605 1.0611 1.1041 1.0885 1.0942 1.0928 1.0977 1.0984 1.0938 1.0975 1.0976 1.1051 1.1043 1.1046
irintensity: 1.1253 0.1672 0.6896 0.6460 0.9130 6.3607 1.4896 0.1588 9.2698 0.5575 7.8862 2.2620 2.4592 1.1449 0.0996 0.1672 0.3654 0.2200 5.2005 3.5035 3.0896 4.6978 1.5546 6.2305 2.2136 0.8813 2.0872 3.4227 4.3165 1.6944 1.0868 0.5292 10.9943 7.5001 0.3600 4.8039 82.0728 27.6645 2.4584 76.1686 0.2906 67.4553 21.1786 6.9550 87.6205 5.4374 17.8700 2.5933 1.1647 4.4802 1.0476 17.8189 12.0953 7.7436 12.1338 40.5388 23.8916 11.6289 20.7831 13.4415 3.5084 13.1844 6.6938 2.6134 12.6971 7.8002 10.9877 17.2222 147.2068 30.8588 35.7680 48.8812 38.6753 32.0417 23.4980 20.6729 60.6385 1.4578 7.7680 78.0133 22.1388 38.5050 23.7169 59.6104 29.0744 28.3722 17.4670
temp: 298.150 k
press: 1.00000 atm
elementType: 8 8 6 6 6 6 6 6 6 6 6 6 6 1 1 1 1 1 1 1 1 1 1 1 1 1 1 1 1 1 1
symmnumber: 1
zpe: 707001.1 jmol-1
zpe.correction: 0.269282 hartree
zpe.thermalcorrener: 0.282652 hartree
zpe.thermalcorrenthalpy: 0.283596 hartree
zpe.thermalcorrgfe: 0.227882 hartree
zpe.sumelectzpe: -579.382960 hartree
zpe.sumelectthermal: -579.369590 hartree
zpe.sumelectthermalent: -579.368646 hartree
zpe.sumelectthermalfe: -579.424361 hartree
dipole: -0.0114 -0.2429 -1.5293
dipole: 1.5485
quadrupole: -70.6269 -78.3990 -84.6566
quadrupole: -1.2831 -3.1188 -1.6542
quadrupole: 7.2673 -0.5048 -6.7624 -1.2831 -3.1188 -1.6542
hfenergy: -579.6522425 hartree
pointgroup: C01 [X(C11H18O2)]
dipole: -0.009596 -0.2128433 0.5707425 debye
polarizability: 139.9804457|-0.7929987|105.0979017|2.4401948|-0.3077562|108.5177797 unknown
InChI: InChI=1S/C11H18O2/c1-11(2)6-7-4-8(9(11)5-7)10(12)13-3/h7-9H,4-6H2,1-3H3
charge 0 multiplicity 1
31 atoms
O  2.857246 0.149528 0.825258
O  2.194182 0.554325 -1.367518
C  -0.642722 0.510337 -0.547273
C  -2.016386 0.48312 0.231726
C  -1.051199 -1.72445 -0.357671
C  -0.781767 -0.710368 -1.504956
C  -2.278796 -1.077095 0.350629
C  0.505298 0.027116 0.390151
C  0.211083 -1.528869 0.532334
C  -3.112757 1.176403 -0.62016
C  -1.984451 1.177553 1.616157
C  1.888694 0.280387 -0.183261
C  4.263645 0.326768 0.391605
H  -0.432593 1.480466 -1.027057
H  -1.210576 -2.772988 -0.660676
H  0.142915 -0.909321 -2.07154
H  -1.621862 -0.626277 -2.214862
H  -3.217291 -1.357331 -0.16439
H  -2.368487 -1.402318 1.404241
H  0.482197 0.512835 1.378866
H  1.056547 -2.133124 0.156829
H  0.039614 -1.812193 1.585548
H  -2.929572 2.26602 -0.687827
H  -3.154514 0.776429 -1.648873
H  -4.109626 1.028766 -0.162904
H  -1.629347 2.222969 1.534529
H  -3.002201 1.202706 2.049663
H  -1.338601 0.651148 2.341507
H  4.859496 0.172422 1.302235
H  4.414049 1.341112 -0.015041
H  4.523781 -0.412974 -0.38447
