program: Gaussian 09
title: 000103636
version: EM64L-G09RevD.01
frameworkgroup: C1[X(C18H18N5S)]
method: RPBEPBE
basis: SDD
operation: Freq
keyword: #p
keyword: freq=noraman
keyword: PBEPBE/SDD
title: #p freq=noraman PBEPBE/SDD
converged: YES YES NO NO
title: Mulliken charges:
elementType: S N N N N N C C C C C C C C C C C C C C C C C C H H H H H H H H H H H H H H H H H H
charge: 0.367576 -0.222119 -0.186833 -0.158726 -0.118340 -0.013597 0.282335 0.280115 0.421314 -0.344180 -0.334296 -0.638815 -0.652814 -0.372071 -0.206344 -0.208587 0.620048 -0.371644 -0.225872 -0.316621 -0.638701 -0.252527 -0.208367 -0.225959 0.253135 0.260579 0.268123 0.271263 0.256811 0.258166 0.298058 0.254165 0.273430 0.254969 0.254621 0.260292 0.254599 0.281004 0.256528 0.263142 0.250824 0.255317
chargesum: 1.00000
title: Mulliken charges with hydrogens summed into heavy atoms:
elementType: S N N N N N C C C C C C C C C C C C C C C C C C
charge: 0.367576 -0.222119 -0.186833 -0.158726 -0.118340 -0.013597 0.282335 0.280115 0.421314 -0.091045 -0.073717 0.157382 0.157574 -0.098641 0.048625 0.046034 0.620048 -0.371644 -0.225872 -0.056329 0.153430 0.010615 0.042456 0.029359
polarizability: 7.33180666e+02 -1.18244742e+00 2.43467994e+02 -6.64690353e+00 -3.77708184e+00 1.13171082e+02
1716.lowfreq: -6.7293 -3.1657 0.0013 0.0013 0.0017 3.5447 19.6772 23.4245 31.1101
frequency: 19.6104 23.4155 31.0723 64.9263 79.9180 96.2876 107.8304 132.0181 138.1023 142.8877 152.0236 163.4400 171.4175 199.8503 208.8268 246.1686 256.1397 286.4579 297.8296 323.8196 330.9002 345.9654 370.4155 386.7773 435.2239 443.5998 452.5003 490.0784 491.3698 519.6299 533.9363 540.2120 557.6378 567.0467 588.8954 604.0603 637.7000 675.4190 678.9796 705.9289 723.9208 749.7931 755.6827 759.5694 763.1424 807.0656 856.2559 858.5440 866.6833 894.4200 933.9549 946.5174 948.4642 976.1889 993.8033 994.5145 1015.3209 1016.3442 1025.2096 1032.1253 1075.6520 1116.9956 1120.5806 1121.0011 1130.6390 1133.5983 1134.9255 1139.6382 1144.3948 1181.9756 1183.9770 1232.5948 1251.6699 1256.0527 1302.5016 1305.7474 1311.5992 1319.3212 1347.8794 1390.3055 1399.5884 1416.7184 1420.3298 1431.6031 1444.4453 1445.7203 1451.3495 1460.9314 1469.8329 1471.3695 1475.7620 1476.6455 1478.5779 1491.9089 1492.8700 1502.7193 1508.9734 1572.8098 1592.0195 1598.1753 1615.3353 1621.7790 2998.8246 2999.8586 3011.0131 3087.6875 3088.6732 3090.3437 3102.7966 3133.5237 3139.3112 3150.2543 3152.8566 3155.6122 3161.6343 3163.9235 3171.7524 3174.4449 3184.7121 3186.3764
redmass: 4.2202 4.8154 5.4270 3.9677 1.1206 2.0576 1.5704 3.1569 2.7429 1.6228 1.8743 5.4974 5.3351 4.8846 3.8116 6.6697 3.4140 3.8022 2.8179 5.0611 5.0703 3.8225 4.7054 6.4733 3.3237 4.2283 6.9928 6.8360 10.4848 5.4982 4.9912 4.4663 5.2619 3.6975 5.1375 7.5553 5.2708 6.5001 6.8396 6.4138 3.3476 4.4752 4.9170 1.3137 1.3670 4.6338 1.4071 1.3545 4.1678 1.4787 2.9831 1.3640 1.3692 7.7138 1.3315 1.3357 2.7807 3.6018 2.8239 3.8112 4.2358 1.9299 1.3498 1.3612 1.3385 2.0575 1.7451 1.4795 1.4831 1.1078 1.1018 3.2034 2.0471 2.0764 2.6598 2.4116 1.7733 2.1072 3.4811 3.7456 7.7369 3.3259 2.1506 1.7116 1.5929 2.0593 2.4609 1.2693 1.2885 1.8137 1.4611 1.2746 1.3457 1.3942 1.3157 1.1717 2.1252 6.5173 7.0683 6.7682 7.5811 7.4666 1.0351 1.0359 1.0358 1.1007 1.0892 1.1020 1.1029 1.1016 1.0997 1.0990 1.0871 1.0871 1.0903 1.0905 1.0957 1.0962 1.1008 1.1006
irintensity: 0.8133 0.1368 0.1428 0.1803 0.6170 1.2334 1.9059 2.5109 0.1049 3.4051 5.1712 1.1385 2.0496 9.4446 1.7716 4.2701 0.6537 1.0579 3.0261 1.8692 0.6429 5.2209 2.4315 1.2614 12.1351 5.5982 4.6285 18.7468 4.5521 9.2790 1.3809 5.3248 6.7504 0.1170 0.3108 14.6278 0.5829 15.4299 6.7842 0.4241 6.3234 0.5251 7.1765 97.7179 101.4117 9.8628 0.1142 0.2188 75.5730 31.9292 13.4920 1.5108 1.3864 6.2220 0.0521 0.1054 4.2094 21.3152 3.6099 21.1928 81.3959 7.7044 0.1385 1.8073 1.0677 27.9409 22.6085 15.2286 20.3735 68.0307 1.0341 10.4874 152.7100 35.2931 5.6026 221.0966 98.4978 0.5617 24.0144 337.5964 13.0708 527.0872 589.8855 1.2802 46.8252 58.6440 380.8138 164.4506 17.6035 66.7357 116.3967 180.1632 72.0820 461.1467 165.5737 91.2980 23.2389 182.2709 6.7176 4.5067 6.8561 3.0053 9.6585 31.7777 20.6242 10.2270 10.1790 9.3242 6.3751 2.9269 3.7468 1.1334 0.5947 0.0338 0.9338 1.3660 4.3400 4.6872 13.1056 7.9607
temp: 298.150 k
press: 1.00000 atm
elementType: 16 7 7 7 7 7 6 6 6 6 6 6 6 6 6 6 6 6 6 6 6 6 6 6 1 1 1 1 1 1 1 1 1 1 1 1 1 1 1 1 1 1
symmnumber: 1
zpe: 864959.6 jmol-1
zpe.correction: 0.329446 hartree
zpe.thermalcorrener: 0.351281 hartree
zpe.thermalcorrenthalpy: 0.352225 hartree
zpe.thermalcorrgfe: 0.277023 hartree
zpe.sumelectzpe: -1366.615153 hartree
zpe.sumelectthermal: -1366.593317 hartree
zpe.sumelectthermalent: -1366.592373 hartree
zpe.sumelectthermalfe: -1366.667576 hartree
dipole: -4.4296 -2.0207 1.0624
dipole: 4.9833
quadrupole: -21.7833 -114.4917 -147.9003
quadrupole: -11.8441 -0.9397 2.2058
quadrupole: 72.9418 -19.7666 -53.1752 -11.8441 -0.9397 2.2058
hfenergy: -1366.9445984 hartree
pointgroup: C01 [X(C18H18N5S1)]
dipole: -1.7508232 0.8394265 -0.2717388 debye
polarizability: 733.0165605|5.4155227|240.3217465|10.258944|20.652431|116.4814347 unknown
InChI: InChI=1S/C18H18N5S/c1-21-13-8-4-5-9-14(13)22(2)17(21)12-19-20-18-23(3)15-10-6-7-11-16(15)24-18/h4-12H,1-3H3
charge 1 multiplicity 1
42 atoms
S  3.846326 -1.98386 0.147304
N  -3.452603 -1.343021 -0.588698
N  -2.669907 0.530135 0.366402
N  2.931226 0.479414 -0.232611
N  0.134306 -0.599845 -0.063186
N  1.25453 -1.393102 -0.169052
C  -4.573599 -0.534292 -0.305261
C  -4.07325 0.657196 0.295364
C  -2.296513 -0.689552 -0.175642
C  -5.953533 -0.728046 -0.51492
C  -4.929441 1.697868 0.705179
C  -3.494196 -2.669276 -1.228545
C  -1.794998 1.542492 0.983583
C  -0.995729 -1.277161 -0.313201
C  -6.812399 0.313326 -0.104755
C  -6.310653 1.504595 0.493861
C  4.340157 0.630906 -0.114705
C  5.018046 -0.600097 0.092187
C  2.468802 -0.820864 -0.102811
C  5.063138 1.842299 -0.186237
C  2.084259 1.650197 -0.549373
C  6.41601 -0.65621 0.225222
C  6.466281 1.789173 -0.05194
C  7.138168 0.556426 0.149915
H  -6.356385 -1.637718 -0.96856
H  -4.550938 2.615516 1.163752
H  -2.815911 -2.702738 -2.096844
H  -3.218342 -3.462781 -0.513137
H  -4.516798 -2.858328 -1.584308
H  -2.168904 1.78089 1.993632
H  -0.77482 1.140949 1.045209
H  -1.79122 2.46176 0.371633
H  -0.943536 -2.329191 -0.627415
H  -7.891287 0.202728 -0.248938
H  -7.013781 2.28637 0.796201
H  4.558174 2.801017 -0.333919
H  2.038484 2.331484 0.318886
H  1.06943 1.309142 -0.786054
H  2.515439 2.186131 -1.411812
H  6.934305 -1.606442 0.382518
H  7.044065 2.7171 -0.102113
H  8.227399 0.541007 0.250788
