program: Gaussian 09
title: 000103606
version: EM64L-G09RevD.01
frameworkgroup: C1[X(C13H24O2)]
method: RPBEPBE
basis: SDD
operation: Freq
keyword: #pfreq=noraman
keyword: PBEPBE/SDD
title: #p freq=noraman PBEPBE/SDD
converged: NO YES NO NO
title: Mulliken charges:
elementType: O O C C C C C C C C C C C C C H H H H H H H H H H H H H H H H H H H H H H H H
charge: -0.276741 -0.272399 -0.198448 -0.121811 -0.011454 -0.512926 -0.540279 -0.475337 -0.461926 -0.540215 -0.040466 0.012498 -0.751558 -0.503119 -0.518091 0.236711 0.227317 0.234390 0.221141 0.220181 0.201171 0.227190 0.216739 0.206740 0.201616 0.224238 0.184735 0.243956 0.215655 0.168509 0.233959 0.237925 0.206655 0.191899 0.241272 0.229114 0.236021 0.197333 0.207804
chargesum: 0.00000
title: Mulliken charges with hydrogens summed into heavy atoms:
elementType: O O C C C C C C C C C C C C C
charge: -0.276741 -0.272399 0.038263 0.105506 0.222936 -0.071604 -0.111918 -0.051858 -0.036073 -0.111525 0.175189 0.181008 -0.073019 0.159166 0.123068
polarizability: 1.59957642e+02 -4.18688681e-02 1.36261392e+02 7.00784205e-01 4.93997130e-01 1.26152995e+02
1716.lowfreq: -11.3936 -3.3719 -0.0003 0.0005 0.0007 12.3629 26.9709 43.9710 60.6203
frequency: 25.1412 43.6605 60.3909 63.9209 93.0348 105.9971 136.9990 157.5780 166.6408 178.5869 208.2170 226.3148 266.4375 289.9102 303.8579 322.1484 374.6029 384.2442 436.8576 475.9633 504.4911 512.5188 539.6321 640.1075 714.5017 752.0066 787.4829 800.3534 827.8345 834.9627 873.0391 887.6553 889.5314 904.4984 924.7166 936.2843 951.2416 959.2787 960.9020 973.5273 1009.9969 1011.3505 1028.5989 1038.1052 1049.4094 1081.5668 1094.2282 1107.1236 1111.5950 1114.1700 1115.3498 1123.1791 1136.3779 1147.0668 1163.1012 1169.7711 1174.7086 1203.8705 1231.1390 1234.4433 1244.9424 1260.5215 1267.9406 1280.4046 1293.3848 1299.1224 1303.5367 1309.5783 1321.4031 1331.7194 1341.0828 1347.5638 1360.6404 1382.7973 1427.3880 1435.2969 1452.1275 1455.1675 1458.6846 1468.9949 1470.4776 1471.3747 1476.7606 1479.6978 1481.6115 1487.2149 1495.4690 2834.1615 2926.3541 2944.2190 2955.7758 2964.9593 2977.1524 2989.3024 2989.6204 2990.3423 2998.2956 3001.6423 3004.7754 3027.7367 3041.1556 3044.3886 3047.8773 3054.5118 3060.8064 3066.2496 3070.9435 3082.8562 3094.4635 3098.6240 3116.0547
redmass: 3.1783 3.6525 3.2041 2.4315 2.8147 2.3162 1.6355 1.2157 1.7665 2.5858 1.2511 2.3870 3.1351 2.3184 2.7726 3.1120 2.1395 2.3403 1.7762 3.1876 3.7084 2.6604 4.2953 2.9589 3.1131 3.3319 2.7785 1.4471 2.2113 2.9593 2.9356 2.1974 2.9909 2.0977 2.5996 1.8838 1.8068 1.9128 1.8467 1.7690 2.3501 7.5863 1.4267 2.1387 2.2762 1.5894 1.6868 1.3450 1.2769 1.2196 1.1631 1.2846 1.9668 1.4945 1.6048 1.8868 2.1475 1.4300 1.4058 1.4943 1.4851 1.3407 1.3164 1.4236 1.4937 1.3789 1.5050 1.5839 1.4842 1.3200 1.4772 1.2541 1.4109 1.2338 1.1519 1.1340 1.0531 1.0865 1.0612 1.0822 1.0871 1.0574 1.0535 1.0755 1.0531 1.0616 1.0943 1.0821 1.0349 1.0400 1.0658 1.0804 1.0791 1.0568 1.0581 1.0424 1.0594 1.1013 1.0633 1.0969 1.0969 1.0937 1.1025 1.0919 1.0946 1.1027 1.1048 1.0994 1.0998 1.0971 1.1024
irintensity: 0.6239 0.6525 0.3359 2.5949 2.7587 3.8795 0.4685 1.1634 0.8997 3.8760 2.0964 2.7637 7.5390 2.5037 1.0398 0.4176 1.2368 1.3306 0.2646 0.6988 7.5478 4.8897 0.7723 0.6557 2.5292 1.8128 1.9545 2.9530 7.3400 7.7559 33.2837 14.3334 16.4749 18.6370 1.1300 4.4464 8.1984 8.0931 7.6587 3.3412 8.8513 150.3626 0.5657 34.6181 78.2530 5.9526 8.4404 6.5141 3.9910 1.6045 2.9252 5.7122 16.8222 9.9341 3.0916 9.5941 14.9137 1.2569 3.6946 2.5264 1.1011 0.3112 3.1359 3.7560 1.5212 5.7657 0.4889 10.8099 1.5367 4.2601 6.1896 14.8705 5.6495 27.1413 7.4744 7.8272 9.7138 3.5389 8.2234 5.0522 11.5389 9.7291 12.4814 6.4951 12.0895 15.8420 7.2126 74.0558 67.1496 76.1955 20.1816 28.5726 23.4983 61.6871 15.8127 23.6790 52.7827 70.5676 62.3407 42.5694 48.7170 60.0563 18.7737 49.5877 15.8625 63.0007 95.0826 36.8585 25.2251 31.0640 24.2583
temp: 298.150 k
press: 1.00000 atm
elementType: 8 8 6 6 6 6 6 6 6 6 6 6 6 6 6 1 1 1 1 1 1 1 1 1 1 1 1 1 1 1 1 1 1 1 1 1 1 1 1
symmnumber: 1
zpe: 912914.5 jmol-1
zpe.correction: 0.347711 hartree
zpe.thermalcorrener: 0.364300 hartree
zpe.thermalcorrenthalpy: 0.365244 hartree
zpe.thermalcorrgfe: 0.302640 hartree
zpe.sumelectzpe: -658.960599 hartree
zpe.sumelectthermal: -658.944010 hartree
zpe.sumelectthermalent: -658.943066 hartree
zpe.sumelectthermalfe: -659.005669 hartree
dipole: 0.2592 1.4723 -1.8275
dipole: 2.3610
quadrupole: -93.3924 -90.4507 -93.2908
quadrupole: -2.3725 7.7705 0.1837
quadrupole: -1.0144 1.9273 -0.9128 -2.3725 7.7705 0.1837
hfenergy: -659.3083099 hartree
pointgroup: C01 [X(C13H24O2)]
dipole: 0.1167657 -0.4103937 0.8251095 debye
polarizability: 159.9390013|0.2933943|136.0095592|-0.9744588|-1.675874|126.4234695 unknown
InChI: InChI=1S/C13H24O2/c1-9(13(14-2)15-3)6-12-8-10-4-5-11(12)7-10/h9-13H,4-8H2,1-3H3
charge 0 multiplicity 1
39 atoms
O  -2.932997 1.240779 -0.03988
O  -3.380078 -1.069351 -0.040137
C  2.071244 -0.838314 -0.514197
C  3.688088 0.598783 0.219272
C  1.403981 0.566108 -0.712517
C  3.55225 -0.510254 -0.866447
C  2.506627 1.546409 -0.15055
C  2.192446 -1.183018 1.001594
C  3.299711 -0.18381 1.510383
C  0.010815 0.776691 -0.081751
C  -1.077779 -0.21951 -0.562994
C  -2.363652 -0.039499 0.270642
C  -1.379152 -0.110829 -2.074582
C  -4.105288 1.579266 0.776091
C  -3.22052 -2.297608 0.736067
H  1.602899 -1.638134 -1.113612
H  4.666784 1.103498 0.28168
H  1.312029 0.729414 -1.805246
H  3.679924 -0.12999 -1.896641
H  4.238232 -1.362549 -0.707443
H  2.144501 2.10608 0.732928
H  2.810604 2.288838 -0.911334
H  2.516242 -2.232967 1.128032
H  1.237645 -1.071304 1.545363
H  2.927692 0.49507 2.299615
H  4.170328 -0.727616 1.921643
H  0.099152 0.716218 1.024332
H  -0.336991 1.804639 -0.303364
H  -0.720737 -1.249983 -0.350463
H  -2.135409 -0.109579 1.368288
H  -1.65793 0.923906 -2.339082
H  -2.223309 -0.76936 -2.343904
H  -0.501771 -0.404986 -2.678056
H  -3.853346 1.561595 1.858232
H  -4.934371 0.876689 0.580606
H  -4.391484 2.600432 0.48064
H  -4.09574 -2.923786 0.500267
H  -3.199935 -2.091591 1.828396
H  -2.298204 -2.85058 0.461528
