program: Gaussian 09
title: 000103629
version: EM64L-G09RevD.01
frameworkgroup: C1[X(C19H21NO2)]
method: RPBEPBE
basis: SDD
operation: Freq
keyword: #p
keyword: freq=noraman
keyword: PBEPBE/SDD
title: #p freq=noraman PBEPBE/SDD
converged: YES YES NO NO
title: Mulliken charges:
elementType: O O N C C C C C C C C C C C C C C C C C C C H H H H H H H H H H H H H H H H H H H H H
charge: -0.332960 -0.265292 -0.307584 -0.030125 -0.023778 0.260109 0.299082 -0.332858 0.286120 0.368535 -0.544084 -0.624123 -0.417082 -0.384565 -0.393575 -0.355249 -0.442555 -0.244560 -0.242601 -0.257820 -0.236020 -0.618931 0.214207 0.206361 0.241639 0.232696 0.223784 0.271514 0.202636 0.214243 0.215210 0.272693 0.272031 0.231986 0.234205 0.225514 0.224524 0.256964 0.226341 0.223611 0.224839 0.195555 0.229363
chargesum: 0.00000
title: Mulliken charges with hydrogens summed into heavy atoms:
elementType: O O N C C C C C C C C C C C C C C C C C C C
charge: -0.332960 -0.265292 -0.050621 -0.030125 0.190429 0.260109 0.299082 0.115142 0.286120 0.368535 -0.087604 -0.149973 0.012371 -0.111872 -0.121544 -0.123263 -0.208350 -0.019046 -0.018077 -0.031479 -0.012409 0.030826
polarizability: 2.38891854e+02 -1.22370337e+01 2.31317199e+02 2.05876509e+01 6.06282286e+00 1.61582339e+02
1716.lowfreq: -6.8989 -5.6751 0.0004 0.0009 0.0010 5.3665 10.0644 33.5738 57.2721
frequency: 6.2252 33.5120 57.2539 76.4210 90.7485 99.1479 111.5450 125.5454 148.2334 184.4456 207.1305 229.6111 247.2118 275.7109 301.3081 316.7416 324.7757 339.7964 348.9957 367.4684 440.9444 455.4532 463.1149 478.1169 497.2585 533.0277 549.1153 556.2488 591.1867 626.8519 632.1722 659.5154 672.8984 698.5843 721.6280 749.6197 761.2825 764.9669 770.3158 781.0427 857.4558 869.0309 873.1208 892.0455 902.6889 908.7468 922.8614 943.3121 959.9913 960.4486 966.0377 980.1705 990.3734 992.6970 993.9371 1029.1687 1033.8561 1044.8578 1050.7606 1058.1978 1103.0653 1104.7906 1111.1605 1126.7255 1154.2195 1164.4883 1169.5046 1172.5417 1178.6429 1184.8187 1189.6243 1191.6528 1218.1842 1225.1978 1236.3191 1242.0128 1272.2128 1285.9018 1291.0859 1299.2508 1334.7136 1350.8606 1356.0903 1377.0618 1379.4426 1384.4811 1428.8269 1437.2672 1437.7770 1442.4926 1451.4081 1464.8012 1468.8569 1473.0418 1477.6293 1480.7934 1485.1112 1495.8367 1580.9239 1592.0350 1608.0325 1612.7880 2881.7983 2888.9785 2956.9430 2960.0441 2991.1388 3002.0779 3014.3735 3019.9444 3023.6480 3074.7946 3080.6843 3107.3440 3115.7854 3122.3363 3129.8044 3131.1952 3151.7742 3152.4764 3171.4405 3176.5952 3442.7514
redmass: 4.8577 4.1237 3.5402 3.4588 2.0650 2.9287 3.2932 3.4580 2.7687 3.6015 4.5098 1.3258 3.3104 4.3597 5.7039 3.4262 3.2966 4.3730 4.9644 3.4831 2.7009 3.3734 2.5091 4.0406 3.9605 4.2111 3.9291 4.7104 2.9785 4.4604 5.1010 6.2109 1.4117 5.6431 2.9584 2.7341 2.1161 1.8275 2.3636 2.2771 3.3138 2.0876 1.6375 1.7119 2.5290 2.3158 3.3229 4.5436 1.5027 1.9498 1.5656 2.2535 3.1505 1.3739 1.3874 3.4079 2.9555 2.1397 1.5939 2.1737 1.8465 1.8829 1.8274 1.6075 1.8771 2.8697 1.1030 1.0872 1.3080 2.4302 1.6444 1.6413 2.4792 1.3556 1.3557 2.0359 1.6169 1.2150 1.3469 1.2309 1.5116 1.3530 1.9737 2.0536 2.2921 6.8313 2.2423 1.1942 1.8840 1.2425 1.2031 1.0905 1.0723 1.2307 1.8813 2.7052 1.0724 1.0548 6.6402 6.9790 6.3021 6.6385 1.0602 1.0648 1.0615 1.0841 1.0678 1.0772 1.0837 1.0768 1.0895 1.0987 1.0999 1.0876 1.0865 1.0989 1.0887 1.0897 1.0962 1.0969 1.0960 1.0942 1.0743
irintensity: 1.0179 0.0433 1.9739 0.7018 1.2366 3.4324 0.5528 0.6789 1.7866 1.1430 1.3245 1.1202 2.8697 1.3696 5.7498 7.1110 5.2433 3.4396 0.4465 3.5980 6.8786 3.5253 4.6356 4.1784 7.7670 2.0693 1.9863 1.7703 11.5782 12.8470 14.0006 3.6756 94.8113 11.3008 4.8707 10.7993 50.3926 62.0949 13.0081 34.2691 14.8891 18.2116 4.9249 5.4671 31.1802 2.8657 27.0479 4.2231 2.6447 3.1149 12.4989 3.3501 100.8655 5.5108 0.9402 123.9786 45.8448 14.2617 15.2153 3.6436 8.5843 3.9186 22.3743 0.3174 0.8742 58.3586 0.0871 1.8574 1.9055 55.3874 0.9749 2.3973 7.4058 7.9914 4.0573 23.5546 30.3795 1.2516 3.7956 1.6062 1.4596 0.5388 1.2679 1.3668 4.6642 0.5786 9.7000 3.8839 1.3150 14.2534 17.2561 2.7905 13.3465 9.9185 30.5733 9.9575 14.1458 12.6797 1.1668 1.9238 3.9119 2.0847 83.1145 144.3715 26.1233 39.8314 47.1098 21.0288 55.9552 56.9930 29.9019 4.7408 37.1776 10.9619 5.5293 18.1389 13.8147 18.1328 39.5221 27.4524 15.9851 14.0225 0.6072
temp: 298.150 k
press: 1.00000 atm
elementType: 8 8 7 6 6 6 6 6 6 6 6 6 6 6 6 6 6 6 6 6 6 6 1 1 1 1 1 1 1 1 1 1 1 1 1 1 1 1 1 1 1 1 1
symmnumber: 1
zpe: 934059.4 jmol-1
zpe.correction: 0.355764 hartree
zpe.thermalcorrener: 0.374971 hartree
zpe.thermalcorrenthalpy: 0.375915 hartree
zpe.thermalcorrgfe: 0.306473 hartree
zpe.sumelectzpe: -940.190433 hartree
zpe.sumelectthermal: -940.171227 hartree
zpe.sumelectthermalent: -940.170282 hartree
zpe.sumelectthermalfe: -940.239724 hartree
dipole: -1.9196 -0.3220 0.0209
dipole: 1.9466
quadrupole: -108.3585 -120.9481 -132.3328
quadrupole: 4.7030 5.9564 1.5455
quadrupole: 12.1880 -0.4016 -11.7864 4.7030 5.9564 1.5455
hfenergy: -940.546197 hartree
pointgroup: C01 [X(C19H21N1O2)]
dipole: -0.7631783 -0.0635778 -0.0049094 debye
polarizability: 236.1114267|-12.9916711|233.2989598|22.1039355|4.8574054|162.3810061 unknown
InChI: InChI=1S/C19H21NO2/c1-20-12-16-13-21-19(22-16)17-8-4-2-6-14(17)10-11-15-7-3-5-9-18(15)19/h2-9,16,20H,10-13H2,1H3
charge 0 multiplicity 1
43 atoms
O  -1.286537 -0.4680 -0.75016
O  -0.516373 -0.355842 1.484906
N  -4.846175 -0.660622 0.418451
C  -0.068585 -0.219771 0.053042
C  -2.407975 -0.808201 0.164297
C  0.421647 1.221869 -0.202869
C  0.967073 -1.313967 -0.219763
C  -1.978364 -0.147208 1.482413
C  1.635766 1.741253 0.346919
C  2.123049 -1.426868 0.603328
C  2.691293 0.985616 1.166359
C  2.376521 -0.426115 1.715595
C  -3.709653 -0.280644 -0.446886
C  -0.396115 2.072579 -0.994255
C  0.770063 -2.215107 -1.290414
C  1.952344 3.104292 0.092239
C  3.047165 -2.464946 0.33674
C  -0.057346 3.41784 -1.238243
C  1.705836 -3.241945 -1.549345
C  1.129313 3.943574 -0.68263
C  2.847584 -3.371964 -0.729078
C  -6.133406 -0.039966 0.049537
H  -2.444658 -1.912468 0.281996
H  -2.228077 0.932425 1.485354
H  -2.375093 -0.634172 2.38402
H  3.600305 0.910575 0.532833
H  2.971451 1.631202 2.022419
H  1.501687 -0.37539 2.384983
H  3.243732 -0.755648 2.317948
H  -3.798449 -0.650053 -1.497678
H  -3.661905 0.824175 -0.495632
H  -1.300844 1.646323 -1.433936
H  -0.122487 -2.101021 -1.911656
H  2.880294 3.508407 0.51774
H  3.934489 -2.560745 0.97451
H  -0.7097 4.04466 -1.85638
H  1.542045 -3.93333 -2.383588
H  -4.92571 -1.682731 0.507995
H  1.412544 4.988281 -0.85358
H  3.576581 -4.168502 -0.917192
H  -6.925443 -0.401044 0.728816
H  -6.457199 -0.240486 -1.000717
H  -6.062188 1.056288 0.172863
