program: Gaussian 09
title: 000103590
version: EM64L-G09RevD.01
frameworkgroup: C1[X(C5H7NO2S)]
method: RPBEPBE
basis: SDD
operation: Freq
keyword: #p
keyword: freq=noraman
keyword: PBEPBE/SDD
title: #p freq=noraman PBEPBE/SDD
converged: YES YES NO NO
title: Mulliken charges:
elementType: S O O N C C C C C H H H H H H H
charge: 0.205559 -0.104447 -0.259000 -0.385911 -0.021594 -0.699433 -0.165414 0.278117 -0.771315 0.313093 0.287729 0.274237 0.311975 0.259439 0.262896 0.214070
chargesum: 0.00000
title: Mulliken charges with hydrogens summed into heavy atoms:
elementType: S O O N C C C C C
charge: 0.205559 -0.104447 -0.259000 -0.073936 0.291498 -0.137467 -0.165414 0.278117 -0.034910
polarizability: 1.14738570e+02 -4.53467906e+00 7.86045449e+01 -3.41626301e+00 3.27160993e-01 5.99504733e+01
1716.lowfreq: -4.2041 -0.0034 -0.0033 -0.0021 4.0603 7.3058 48.3237 63.5696 74.4175
frequency: 48.2833 63.5513 74.4119 93.9972 184.9761 246.4737 321.4448 373.2148 403.2418 509.4488 553.9256 583.7789 595.2578 610.0155 692.6598 712.6976 861.4914 917.6088 943.4512 994.4286 997.9293 1042.7304 1082.0641 1159.8181 1202.5025 1232.1226 1253.0683 1307.5167 1391.8377 1449.7731 1454.6722 1463.9371 1472.8632 1627.5299 1725.4096 2998.8840 3000.6077 3067.3449 3099.3623 3107.1255 3155.9345 3550.5965
redmass: 3.4692 1.5494 4.0877 2.8340 4.0799 6.3325 4.2766 7.9348 3.8388 5.0599 3.6431 2.3411 2.1863 2.5759 6.4920 7.1211 1.9598 4.6273 1.7364 2.6619 1.7020 1.6493 1.6471 2.1764 1.4709 1.5464 1.8324 1.3972 1.2197 1.0605 1.1174 1.3812 1.2927 6.3347 12.9154 1.0819 1.0362 1.0567 1.0986 1.1001 1.1119 1.0781
irintensity: 5.5983 5.5112 2.6323 5.5268 8.1217 0.2550 1.5528 5.3736 5.6633 38.0912 30.0644 39.8424 28.7201 5.6528 6.9392 40.9863 14.6762 23.5363 6.6206 61.1229 2.9867 12.5207 1.2613 6.1441 8.1225 33.2816 128.5927 85.9109 70.8422 26.4271 21.4099 168.2118 60.9802 171.8084 364.8704 45.4505 8.0875 16.6697 10.1004 13.7023 7.2288 17.3172
temp: 298.150 k
press: 1.00000 atm
elementType: 16 8 8 7 6 6 6 6 6 1 1 1 1 1 1 1
symmnumber: 1
zpe: 308803.9 jmol-1
zpe.correction: 0.117617 hartree
zpe.thermalcorrener: 0.127255 hartree
zpe.thermalcorrenthalpy: 0.128199 hartree
zpe.thermalcorrgfe: 0.081148 hartree
zpe.sumelectzpe: -797.307790 hartree
zpe.sumelectthermal: -797.298153 hartree
zpe.sumelectthermalent: -797.297208 hartree
zpe.sumelectthermalfe: -797.344260 hartree
dipole: -1.6260 -1.9053 -3.6356
dipole: 4.4149
quadrupole: -63.5748 -63.9849 -60.4591
quadrupole: -6.2290 8.5840 0.3670
quadrupole: -0.9018 -1.3120 2.2139 -6.2290 8.5840 0.3670
hfenergy: -797.4254076 hartree
pointgroup: C01 [X(C5H7N1O2S1)]
dipole: 0.7698194 0.2696807 -1.533517 debye
dipolederiv: -0.4633554 0.360257 -0.1385818 0.3724541 -0.5914367 0.2057672 -0.1815864 0.2026156 -0.1505301 -0.412595 -0.1027069 0.024139 -0.0264356 -1.2875041 0.3735081 -0.0254765 0.2991025 -0.336608 -0.7668811 0.0745873 -0.0678213 -0.0942853 -0.4722483 -0.2736589 -0.3616461 -0.1711351 -0.842386 -1.4065882 0.1701647 -0.3077338 0.2330814 -0.4274715 0.1064452 -0.1205937 0.0531879 -0.4137939 0.2686746 -0.221472 -0.0309634 -0.4972047 0.157827 0.0077597 -0.428478 0.0662312 0.166985 0.0420989 0.2577481 -0.1157021 0.1672465 0.0977992 0.0226087 -0.0405132 0.0733779 0.0789959 0.8650336 -0.2588894 0.1952512 -0.2681491 1.6979744 -0.5819324 0.2576247 -0.5459086 0.263423 1.6479571 -0.2541188 0.3640771 -0.1056924 0.441778 0.3564456 0.6421345 0.257607 0.9981676 -0.3083322 0.1825674 0.1348282 0.1948861 -0.1052675 -0.0720644 0.0999575 -0.0548086 -0.0184908 0.2103653 -0.0172879 -0.0350634 0.0343935 0.1054519 -0.0005733 0.1313601 -0.0260174 0.0553178 0.0189703 -0.0991427 -0.0041397 -0.0080821 -0.0557908 -0.0351826 -0.0121286 -0.0695983 0.0785583 0.0122468 -0.0500762 0.095527 -0.015441 0.0714022 -0.0218244 0.0496168 0.0321155 -0.0749973 0.1399142 0.0227176 -0.0324217 0.0435516 0.2396372 -0.0799744 -0.0145228 -0.0778407 0.1571016 0.0002033 -0.0712348 0.0287317 -0.1113188 0.0433524 0.0089622 0.0386655 -0.0264274 0.1025565 0.1078115 0.0301092 -0.0131329 0.0690926 0.0082498 0.056993 -0.013978 0.084122 0.0320622 0.0444763 -0.0232224 -0.0969941 0.0119032 0.0762469 -0.0732792 -0.0204358 -0.0966236 -0.0963617 unknown
polarizability: 111.2963818|-10.7430514|80.6599474|5.2220348|-5.5596271|61.3372589 unknown
InChI: InChI=1S/C5H7NO2S/c1-3(7)6-4-2-9-5(4)8/h4,6H,2H2,1H3
charge 0 multiplicity 1
16 atoms
S  -2.84396 0.896116 -0.197181
O  -1.918363 -1.667325 0.688072
O  2.181608 0.266819 1.359716
N  0.738311 -0.300237 -0.372377
C  -0.402602 0.34733 0.240279
C  -1.071196 1.544553 -0.511985
C  -1.695012 -0.499869 0.365931
C  1.987783 -0.323855 0.258077
C  3.075678 -1.101026 -0.468689
H  -0.069228 0.657087 1.251627
H  -0.899471 2.531585 -0.062693
H  -0.859877 1.552677 -1.590546
H  0.609283 -0.809223 -1.248726
H  3.956549 -0.450836 -0.602157
H  3.390335 -1.95097 0.161588
H  2.760161 -1.487427 -1.452835
