program: Gaussian 09
title: 000103573
version: EM64L-G09RevD.01
frameworkgroup: C1[X(C9H8FN)]
method: RPBEPBE
basis: SDD
operation: Freq
keyword: #pfreq=noraman
keyword: PBEPBE/SDD
title: #p freq=noraman PBEPBE/SDD
converged: YES YES NO NO
title: Mulliken charges:
elementType: F N C C C C C C C C C H H H H H H H H
charge: -0.202934 -0.008669 -0.250357 0.488239 -0.668077 -0.343308 -0.382727 -0.364032 -0.367392 0.319224 -0.194261 0.253793 0.232315 0.236959 0.235256 0.258060 0.239182 0.259742 0.258988
chargesum: 0.00000
title: Mulliken charges with hydrogens summed into heavy atoms:
elementType: F N C C C C C C C C C
charge: -0.202934 -0.008669 0.003436 0.488239 0.036453 -0.085248 -0.143545 -0.104290 -0.108404 0.319224 -0.194261
polarizability: 1.26456987e+02 5.35805716e+00 9.88414960e+01 4.55169655e-01 -9.63299479e+00 5.81529745e+01
1716.lowfreq: -10.0677 -4.7921 0.0004 0.0006 0.0008 6.4444 27.7198 85.0744 124.8188
frequency: 27.5241 85.0688 124.8178 186.6021 218.9583 228.2393 301.3606 368.7341 393.6248 406.7155 411.3952 516.8847 561.0691 565.3206 627.4052 713.5600 723.7611 802.8982 820.1227 835.8031 864.0766 944.4023 962.3465 988.8283 1007.2780 1054.7503 1086.2003 1111.2925 1158.5634 1196.7997 1207.1551 1253.6839 1289.2979 1308.4844 1385.6942 1388.0713 1410.1147 1468.0623 1475.6883 1496.7731 1604.0249 1614.3505 2194.2545 2993.4483 2996.4390 3101.6819 3106.8546 3130.5674 3143.4882 3175.8797 3178.5014
redmass: 3.9961 6.6224 7.0357 4.4104 1.7735 1.6827 5.3136 7.4145 5.4783 5.5144 2.9689 3.1582 4.6087 5.1740 7.2243 3.8239 3.4844 5.4196 1.2585 1.5443 2.6010 1.3457 1.3556 2.2009 2.7153 2.1272 1.8416 1.3254 1.5071 1.5474 2.9618 1.4925 1.3638 1.4833 5.2485 1.2216 2.8784 1.0452 1.0757 2.4913 7.5952 6.3702 12.5708 1.0823 1.0341 1.1015 1.1016 1.0903 1.0903 1.0952 1.0961
irintensity: 2.5155 1.9891 2.6191 1.1056 0.5045 0.1662 0.5730 2.7962 2.1588 1.1851 0.0583 12.9321 16.8214 14.4810 0.0791 4.9277 2.5725 11.2981 3.3979 76.8615 0.2213 0.2996 0.0141 10.4829 7.3752 5.5993 19.2786 7.6776 35.9613 1.6759 49.8128 2.3028 5.2331 2.9104 0.7250 9.2613 3.2703 14.8039 1.8484 114.3163 6.1488 14.3339 8.4981 6.2240 19.1012 26.9036 18.0082 10.8051 3.6915 2.7701 1.7346
temp: 298.150 k
press: 1.00000 atm
elementType: 9 7 6 6 6 6 6 6 6 6 6 1 1 1 1 1 1 1 1
symmnumber: 1
zpe: 378121.1 jmol-1
zpe.correction: 0.144019 hartree
zpe.thermalcorrener: 0.154083 hartree
zpe.thermalcorrenthalpy: 0.155027 hartree
zpe.thermalcorrgfe: 0.107583 hartree
zpe.sumelectzpe: -501.551859 hartree
zpe.sumelectthermal: -501.541795 hartree
zpe.sumelectthermalent: -501.540851 hartree
zpe.sumelectthermalfe: -501.588295 hartree
dipole: 0.2462 3.5129 0.6150
dipole: 3.5748
quadrupole: -79.8857 -61.0993 -63.9800
quadrupole: -9.3559 -3.3244 -4.9291
quadrupole: -11.5640 7.2223 4.3417 -9.3559 -3.3244 -4.9291
hfenergy: -501.6958779 hartree
pointgroup: C01 [X(C9H8F1N1)]
dipole: -0.0690369 0.2188789 1.3875868 debye
dipolederiv: -1.172588 -0.047391 -0.1029397 -0.0329804 -0.1611483 0.0170713 -0.1201584 0.0149279 -0.2111258 -0.282055 0.0263647 0.0249985 0.0057396 -0.2235699 0.015554 0.0814617 -0.0338591 -0.2444685 0.2410278 -0.0356755 0.0181613 -0.1560563 0.2196223 -0.0382852 -0.0313316 -0.0327392 0.0971986 0.2888064 0.0509291 0.0292887 0.0662185 -0.0763018 -0.0083578 0.1152985 0.0074395 -0.1708141 -0.0727982 -0.0210277 0.0395344 0.0142657 0.062429 0.0347692 0.0503743 -0.0190792 0.0341809 -0.0225026 -0.0104416 0.0065167 0.0099034 -0.100124 -0.0515472 -0.0561853 -0.075334 0.0473159 -0.0187514 0.0151317 -0.0011605 0.0144328 -0.1116467 -0.0929073 0.0221747 -0.0869646 0.0795984 -0.2251997 -0.0095438 -0.002746 -0.0642985 -0.1319825 -0.0543397 0.153358 -0.040907 -0.0144096 -0.1963036 0.003726 -0.0162206 0.0660037 -0.1230905 -0.0336568 -0.1860909 -0.0551005 -0.0730654 1.2759929 0.0483826 0.116015 0.0363659 0.1130827 -0.0495864 0.1416769 -0.0498092 0.2304014 -0.0105777 -0.0403555 -0.1201621 0.0126204 -0.0844026 -0.0408786 -0.1756511 0.0225749 0.0985684 0.0181785 0.023617 0.0237138 0.0541458 -0.026752 0.048868 0.0032393 0.0570704 0.0081986 0.0571054 -0.000388 0.1153178 0.0129464 0.0651567 -0.0037778 0.1087178 -0.027579 -0.072525 0.0953026 0.05487 -0.042775 0.0331841 -0.0388375 0.0399191 -0.0363375 0.1065675 0.021281 -0.1674739 -0.0339964 -0.0734565 -0.0416518 0.0661728 -0.0197818 -0.0700839 -0.0277812 0.09495 0.0551698 -0.0344349 0.0652863 -0.0431304 0.1228262 0.0498208 0.07311 0.0512021 0.033232 0.0481738 0.0352142 -0.0878919 0.0314385 0.1211043 0.0621732 -0.0737979 0.0638546 -0.0243175 0.0574747 0.0118617 -0.0501677 0.0191677 0.1563818 0.0613559 -0.0627174 0.0616189 0.0189744 0.0310181 -0.0368426 0.0586875 -0.0383152 0.15108 0.0635869 0.062943 0.0638972 0.0468262 unknown
polarizability: 125.5139914|5.9598716|58.9210757|-5.3136385|-10.7002337|99.0163902 unknown
InChI: InChI=1S/C9H8FN/c1-7(6-11)8-2-4-9(10)5-3-8/h2-5,7H,1H3
charge 0 multiplicity 1
19 atoms
F  -3.806001 -0.075766 -0.338375
N  3.316755 -0.003266 -1.827441
C  1.886165 0.1313 0.424929
C  0.373119 0.039825 0.172757
C  2.255774 1.437374 1.199243
C  -0.214099 0.498568 -1.032026
C  -0.463528 -0.461097 1.201448
C  -1.614368 0.464184 -1.212478
C  -1.865482 -0.503936 1.042204
C  -2.408068 -0.035503 -0.166684
C  2.670538 0.047776 -0.825803
H  2.19046 -0.732533 1.049432
H  1.701559 1.467552 2.152918
H  1.979755 2.327712 0.609623
H  3.337693 1.475485 1.413469
H  0.421806 0.872549 -1.841955
H  -0.021797 -0.827868 2.135743
H  -2.082221 0.809367 -2.138802
H  -2.522761 -0.892823 1.824998
