program: Gaussian 09
title: 000103540
version: EM64L-G09RevD.01
frameworkgroup: C1[X(C10H12ClFO)]
method: RPBEPBE
basis: SDD
operation: Freq
keyword: #p
keyword: freq=noraman
keyword: PBEPBE/SDD
title: #p freq=noraman PBEPBE/SDD
converged: YES YES NO NO
title: Mulliken charges:
elementType: Cl F O C C C C C C C C C C H H H H H H H H H H H H
charge: -0.079254 -0.207523 -0.453007 -0.232944 -0.394042 -0.342205 0.518292 -0.592362 -0.333978 -0.417503 -0.364242 -0.369268 0.317065 0.195697 0.250015 0.180571 0.257719 0.196440 0.269513 0.255552 0.266796 0.234592 0.335492 0.254099 0.254483
chargesum: 0.00000
title: Mulliken charges with hydrogens summed into heavy atoms:
elementType: Cl F O C C C C C C C C C C
charge: -0.079254 -0.207523 -0.117515 -0.037246 0.036545 0.111954 0.518292 -0.067298 -0.067182 -0.182911 -0.110143 -0.114785 0.317065
polarizability: 1.26507739e+02 2.28787855e+01 9.93201348e+01 -5.00998422e-01 2.78593055e+00 1.17791724e+02
1716.lowfreq: -11.7890 -6.2163 0.0006 0.0009 0.0017 4.4997 24.1979 29.6282 54.3764
frequency: 24.0685 29.4476 54.2592 88.4010 130.6365 172.7141 191.9963 219.2683 262.3478 286.3854 318.8121 382.1759 385.1110 412.0627 440.7364 473.8959 548.7752 552.1729 600.4542 627.7372 701.5621 726.1264 793.5630 810.6681 818.2955 838.5889 867.8631 940.4285 950.4478 964.5629 992.0412 1005.9571 1015.1217 1055.1452 1088.1232 1104.2669 1133.7342 1154.7628 1158.9822 1186.4735 1196.9135 1228.7862 1265.2165 1279.2027 1293.9757 1305.4679 1315.2398 1360.6865 1378.1431 1397.2646 1415.0889 1448.9873 1452.3405 1464.7902 1497.5864 1605.2231 1613.9729 2933.8697 2955.4733 2956.9319 3041.8684 3049.9189 3063.1529 3128.2462 3131.0414 3158.6802 3173.7551 3179.2430 3554.3806
redmass: 8.7587 4.2506 4.0681 7.6028 4.0669 3.4526 4.1604 2.5571 3.2592 1.3704 3.4726 4.4652 5.3798 2.9733 4.7737 3.3985 4.0631 2.7550 4.1078 7.0049 2.9902 3.6441 1.6551 3.4316 1.2679 1.5798 1.6160 1.5821 2.8155 1.3611 3.0932 2.8113 2.0068 1.8940 2.2426 1.3903 1.3128 1.4394 1.3972 1.3883 2.1647 1.5511 1.2228 1.2068 1.2786 1.1485 1.2443 1.7521 2.7468 3.4346 1.9742 1.0783 1.1014 1.1048 2.7705 7.5948 6.4741 1.0842 1.0673 1.0659 1.0804 1.0695 1.0946 1.0900 1.1109 1.0884 1.0953 1.0973 1.0659
irintensity: 0.6742 1.3110 1.5734 1.5702 0.9353 5.6577 0.6852 4.2963 11.3978 104.8026 35.3231 5.1076 2.7564 0.4519 11.1003 13.3939 13.9144 17.0165 22.1730 0.5246 9.8187 0.4366 29.1218 28.7641 5.1660 71.8267 6.5970 12.5679 35.6307 0.2454 35.9120 8.6973 5.7633 1.0057 9.8458 6.8034 0.6733 35.4799 75.1766 1.3644 47.6354 8.5481 4.3398 2.0416 9.1304 21.7025 15.8655 2.2042 12.4293 9.8254 10.6821 7.5795 7.4746 9.2490 83.9154 7.0757 22.6242 43.0472 28.9309 44.9309 10.0117 11.4955 46.7874 13.0896 16.8420 2.5931 4.6551 2.0756 5.7603
temp: 298.150 k
press: 1.00000 atm
elementType: 17 9 8 6 6 6 6 6 6 6 6 6 6 1 1 1 1 1 1 1 1 1 1 1 1
symmnumber: 1
zpe: 516509.3 jmol-1
zpe.correction: 0.196728 hartree
zpe.thermalcorrener: 0.209877 hartree
zpe.thermalcorrenthalpy: 0.210821 hartree
zpe.thermalcorrgfe: 0.154658 hartree
zpe.sumelectzpe: -1022.401936 hartree
zpe.sumelectthermal: -1022.388787 hartree
zpe.sumelectthermalent: -1022.387843 hartree
zpe.sumelectthermalfe: -1022.444007 hartree
dipole: 2.8603 2.1143 2.8841
dipole: 4.5793
quadrupole: -93.7137 -87.8239 -75.5661
quadrupole: 7.2736 5.2509 -0.3203
quadrupole: -8.0124 -2.1227 10.1351 7.2736 5.2509 -0.3203
hfenergy: -1022.5986641 hartree
pointgroup: C01 [X(C10H12Cl1F1O1)]
dipole: -1.2783146 0.4179907 -1.1987606 debye
dipolederiv: -0.2518443 -0.0406414 0.0429445 -0.076398 -0.2432722 0.0946169 0.1471888 0.1454722 -0.5099611 -0.9246432 0.4167654 -0.1206623 0.4643042 -0.4098855 0.0560663 -0.1381679 0.0585666 -0.2265105 -0.2815139 -0.111398 0.0970119 -0.0598812 -0.9069722 -0.0389766 0.1022283 -0.0681789 -0.4841382 0.4471176 0.0091864 -0.0185596 -0.1266072 0.7609093 0.0359435 -0.0217925 0.0373855 0.4204706 -0.0293813 -0.153211 0.0427927 0.0062027 -0.0758045 -0.0359663 0.0707427 -0.0128673 0.0123676 -0.0501578 -0.0771924 0.0296424 -0.0282526 0.0023024 0.0035818 0.1504562 0.0836708 -0.0044721 0.0779549 -0.0303529 0.0020431 -0.1001385 -0.1039241 -0.0208117 0.0071371 -0.0215433 -0.1421299 0.2732503 0.0362417 -0.0925742 0.0457768 0.2320893 -0.1546318 -0.1724048 -0.2233316 0.683522 -0.0664657 -0.048806 0.0326803 -0.101258 -0.0211021 0.0501053 -0.0069637 0.0533484 0.0609409 -0.0206171 -0.1021694 0.0161572 -0.0662192 -0.0866174 0.0618695 0.0360416 0.0413247 0.0805246 -0.1894597 0.0180795 0.0236028 0.0744009 -0.1822862 0.030093 0.1481369 -0.0420072 -0.0013707 -0.2084452 0.0238262 -0.0142782 -0.018785 -0.1294625 0.032147 -0.1729801 0.1221808 -0.0711463 0.9650815 -0.4947449 0.1439492 -0.527229 0.3981135 -0.0382914 0.1673513 -0.0477546 0.2687232 -0.0161831 0.0035453 -0.0298139 -0.001905 -0.0292921 -0.0210146 -0.0408134 0.0074326 -0.2123047 0.0884204 -0.0041741 -0.0442824 -0.0002944 0.069175 0.0128663 -0.025341 0.0052943 -0.0737156 -0.1820013 0.1439463 -0.021059 0.0922034 -0.0554094 0.0002242 -0.0207273 0.0184284 0.0683189 -0.0130814 0.0874057 -0.00268 0.103953 -0.0158182 0.0059135 -0.0531423 -0.0032619 0.0756066 0.0632851 -0.036786 0.0570056 -0.0288609 0.054157 0.079745 -0.0177915 0.0047651 -0.1548995 0.0587653 -0.0473709 0.0069973 -0.0902941 -0.0812515 -0.0502847 -0.0065044 -0.0444272 -0.0640858 -0.0587139 0.0576799 -0.0130114 0.1269832 0.0115492 0.0608912 0.0010342 0.0597051 -0.0339896 0.1031597 0.0471588 0.0467897 0.0394072 0.1025605 -0.0618911 0.0561937 -0.0560552 0.0285324 0.0668289 0.0313279 -0.1081337 0.0341203 0.1177046 0.0045041 -0.0946401 -0.0075737 -0.0500147 -0.0110346 0.1603488 -0.043136 0.1124725 0.3357183 -0.0259059 -0.077828 -0.0314793 0.312038 0.0786729 0.0391896 -0.0697608 0.0442704 0.1454084 -0.0115431 -0.083021 -0.0067959 -0.008233 0.0810059 0.0721452 0.036335 0.0820284 0.1114104 -0.0692502 0.0456074 -0.0722985 0.0259268 unknown
polarizability: 130.9589362|-19.2562434|95.5004559|3.9393671|4.2867831|117.1602054 unknown
InChI: InChI=1S/C10H12ClFO/c11-7-1-2-10(13)8-3-5-9(12)6-4-8/h3-6,10,13H,1-2,7H2
charge 0 multiplicity 1
25 atoms
Cl -3.709699 -1.74203 1.535872
F  3.967885 -1.412813 0.332295
O  -0.761955 2.788522 0.174985
C  -0.89643 1.49686 -0.530836
C  -2.13308 0.728113 0.007535
C  -2.374435 -0.621392 -0.700488
C  0.410387 0.748281 -0.315674
C  -3.686256 -1.300946 -0.311163
C  1.017706 0.734997 0.965394
C  1.018856 0.034544 -1.375768
C  2.210044 0.015475 1.191863
C  2.210362 -0.698237 -1.170572
C  2.7756 -0.690176 0.114935
H  -1.0378 1.676045 -1.620418
H  -2.005456 0.562691 1.093086
H  -3.031212 1.370638 -0.123082
H  -1.529647 -1.30779 -0.509569
H  -2.412845 -0.46367 -1.801318
H  -3.8302 -2.261848 -0.827634
H  -4.563461 -0.650557 -0.455347
H  0.565311 1.316627 1.773981
H  0.570494 0.0555 -2.376247
H  -1.634016 3.25908 0.14824
H  2.696431 -0.000095 2.171522
H  2.694916 -1.252019 -1.979791
