program: Gaussian 09
title: 000103604
version: EM64L-G09RevD.01
frameworkgroup: C1[X(C20H31NO4)]
method: RPBEPBE
basis: SDD
operation: Freq
keyword: #p
keyword: freq=noraman
keyword: PBEPBE/SDD
title: #p freq=noraman PBEPBE/SDD
converged: YES YES NO NO
title: Mulliken charges:
elementType: O O O O N C C C C C C C C C C C C C C C C C C C C H H H H H H H H H H H H H H H H H H H H H H H H H H H H H H H
charge: -0.299009 -0.278075 -0.286571 -0.458624 -0.406708 -0.071717 -0.084072 -0.598508 -0.620544 0.352026 0.137851 0.427335 -0.708412 -0.682195 0.222205 -0.482005 -0.391710 -0.228775 -0.277376 -0.058448 0.276061 -0.433097 -0.717390 -0.710899 -0.698391 0.220083 0.218105 0.278484 0.211936 0.208934 0.242427 0.252009 0.209074 0.217550 0.222838 0.225958 0.225658 0.235877 0.240064 0.220508 0.183104 0.235946 0.165193 0.199977 0.272837 0.257547 0.211537 0.231969 0.200309 0.255599 0.222618 0.204656 0.212155 0.201571 0.235636 0.356888
chargesum: 0.00000
title: Mulliken charges with hydrogens summed into heavy atoms:
elementType: O O O O N C C C C C C C C C C C C C C C C C C C C
charge: -0.299009 -0.278075 -0.286571 -0.101735 -0.149161 0.148366 0.134033 -0.108088 -0.169183 0.352026 0.137851 0.427335 -0.029778 -0.007742 0.222205 -0.246128 -0.151646 -0.008268 0.141674 0.106744 0.276061 0.039717 -0.073575 -0.028026 -0.049028
polarizability: 2.61661555e+02 2.47142208e+00 2.40150400e+02 -4.60556520e+00 -1.77798515e+01 1.93833546e+02
1716.lowfreq: -9.9514 -0.0003 0.0007 0.0011 4.1164 7.0263 12.6796 21.1951 37.0320
frequency: 11.3017 20.9900 36.9659 38.8710 48.6623 55.0252 73.1089 84.0425 99.6624 113.4445 152.7578 154.9349 171.9054 184.6558 207.9486 213.0497 222.2101 238.5426 258.8675 260.8199 264.6790 275.4630 291.3316 296.9340 301.2376 303.1478 339.1074 344.1046 358.4703 402.3440 428.7793 438.6825 446.5450 465.8695 476.1509 487.5328 497.1378 500.0257 516.7631 532.1816 583.1922 601.3002 613.9422 631.0472 658.5726 710.4683 719.3512 745.2423 756.8114 759.7191 770.6939 778.9821 798.0097 807.9366 824.0337 848.8995 859.0736 865.5691 878.3250 886.9829 908.4837 918.0064 918.4721 925.5092 931.6677 950.4961 952.6431 959.2107 976.3084 983.6993 994.7411 1004.9683 1019.0363 1022.8939 1041.0281 1057.5755 1073.7876 1077.7850 1091.7462 1100.3277 1107.4239 1142.4317 1174.0904 1179.7548 1181.6089 1188.8834 1193.6535 1197.1882 1211.9817 1233.0397 1233.2899 1240.6601 1243.3118 1255.1236 1272.8261 1276.7055 1282.7893 1285.5338 1297.1752 1311.4794 1326.2251 1337.9729 1350.9930 1362.7475 1372.7915 1374.8035 1376.2547 1379.9649 1389.8608 1397.0161 1402.0218 1421.8561 1441.1521 1442.5283 1450.6709 1450.9911 1451.9021 1454.9709 1455.4281 1461.4982 1463.4127 1466.5349 1468.5706 1472.5929 1477.8278 1479.1930 1485.0351 1487.9175 1502.5071 1599.1104 1611.3121 2879.7427 2942.9866 2956.8261 2959.3741 2967.1751 2968.8259 2971.6904 2972.1392 2982.6696 2989.8876 2995.2760 3003.7236 3041.2986 3056.3653 3060.7224 3066.9749 3073.0676 3078.4496 3083.5953 3086.1349 3090.3577 3091.7137 3092.6858 3096.7585 3105.5561 3119.4167 3124.6771 3144.1007 3164.0911 3176.0657 3402.6588
redmass: 4.1159 3.8856 3.8228 3.2648 3.8156 3.8358 3.6651 4.6888 4.2447 4.6234 1.0342 3.0498 1.7533 4.4317 1.1870 1.3493 3.1028 1.7447 1.5533 1.7952 1.6063 3.2859 2.4020 2.5179 2.5103 2.5485 2.3267 2.5284 2.3825 2.4683 2.4570 2.3538 3.9124 4.3504 4.1839 3.1653 3.9285 3.3665 2.8618 4.6437 4.0566 4.0327 4.2550 2.8175 1.9158 4.0819 2.7442 3.4286 4.3445 2.5793 4.0637 2.2655 2.9504 1.3558 3.1534 2.9017 2.6792 2.6354 2.0773 2.1465 1.7696 2.0028 1.6819 1.9035 2.1851 1.2270 1.7510 1.4737 2.5111 1.3612 2.8434 1.9850 1.8004 1.4817 2.2749 2.9337 2.2751 2.2130 3.4172 1.8146 2.5111 1.8903 1.1613 1.3359 1.1398 1.4976 2.4192 2.1438 2.4300 1.8079 1.7240 1.6404 1.6513 2.4355 3.3511 2.1604 1.2690 1.1959 1.3154 1.8700 1.2642 1.2703 1.4419 1.6018 1.2227 1.2998 1.2986 1.2278 1.2455 4.1070 1.2246 1.5939 1.1748 1.1518 1.0774 1.3231 1.0521 1.0589 1.1983 1.0498 1.7586 1.0560 1.0647 1.0496 1.0717 2.3671 1.0654 1.1063 1.0567 6.9424 7.6102 1.0815 1.0699 1.0731 1.0692 1.0365 1.0577 1.0390 1.0773 1.0359 1.0459 1.0753 1.0356 1.1044 1.0932 1.0984 1.0978 1.0993 1.0987 1.0905 1.0995 1.0998 1.0963 1.0950 1.1003 1.0995 1.1007 1.0860 1.0927 1.0970 1.0632 1.0737
irintensity: 0.5197 0.8612 0.0602 0.0799 1.4658 1.2194 0.2784 3.8491 0.4909 6.1405 0.0688 4.7055 0.3003 2.2744 1.3900 1.0576 3.0092 1.7361 0.6142 0.7432 0.1560 1.9716 7.0013 1.9625 3.3393 0.7704 1.5402 0.9398 0.7273 7.8035 0.0160 0.3587 1.0789 1.1234 4.2799 3.6547 9.5580 3.7398 8.4968 0.9491 1.7458 0.5022 3.3869 20.7230 12.7480 19.1987 19.0215 4.5924 9.4828 29.5424 6.5778 34.0396 62.2080 90.3424 12.3938 11.6770 8.0055 30.5973 7.9147 4.2070 1.7269 13.1022 10.3545 4.1692 15.0010 1.4018 15.1372 9.6023 5.9149 5.7269 89.8882 27.9392 51.1902 5.1723 4.7173 29.2697 29.4593 23.9476 14.8128 19.4650 21.1436 61.0814 1.7431 47.8262 2.6319 56.1355 112.5788 31.8250 72.5926 4.3046 18.0400 41.3244 3.0275 133.2853 20.2190 13.9290 2.4560 21.8701 1.2818 8.1385 8.9647 14.8649 13.4267 4.2368 16.5418 28.4899 40.1600 27.9964 27.2716 6.1237 20.2493 81.9802 9.0809 3.2418 11.6762 79.1432 1.8270 2.0304 16.0731 0.6085 10.5250 6.8951 2.2715 9.8469 14.2742 30.2165 7.4863 10.4081 16.9825 60.2690 19.4821 86.1338 41.6443 1.7001 24.8786 27.2281 67.8703 55.9574 19.0342 5.6326 14.0025 154.1071 12.7158 29.6506 16.6551 4.7247 54.2666 17.8909 52.8629 5.7342 8.0421 28.1338 34.3541 30.9381 1.9655 37.0291 21.4627 4.0341 28.9524 19.6346 218.0531 1.4780
temp: 298.150 k
press: 1.00000 atm
elementType: 8 8 8 8 7 6 6 6 6 6 6 6 6 6 6 6 6 6 6 6 6 6 6 6 6 1 1 1 1 1 1 1 1 1 1 1 1 1 1 1 1 1 1 1 1 1 1 1 1 1 1 1 1 1 1 1
symmnumber: 1
zpe: 1253030.9 jmol-1
zpe.correction: 0.477254 hartree
zpe.thermalcorrener: 0.503466 hartree
zpe.thermalcorrenthalpy: 0.504410 hartree
zpe.thermalcorrgfe: 0.419829 hartree
zpe.sumelectzpe: -1134.405892 hartree
zpe.sumelectthermal: -1134.379680 hartree
zpe.sumelectthermalent: -1134.378736 hartree
zpe.sumelectthermalfe: -1134.463318 hartree
dipole: 0.4583 2.7377 1.7148
dipole: 3.2627
quadrupole: -143.9877 -148.9906 -147.6484
quadrupole: 5.4992 13.4487 -13.2374
quadrupole: 2.8878 -2.1150 -0.7728 5.4992 13.4487 -13.2374
hfenergy: -1134.8831463 hartree
pointgroup: C01 [X(C20H31N1O4)]
dipole: 0.2391806 1.0180677 0.7443776 debye
polarizability: 261.3255902|1.7005944|242.3918145|-7.5457764|-14.0783632|191.9280968 unknown
InChI: InChI=1S/C20H31NO4/c1-19(2,3)21-11-14(22)12-23-16-8-6-7-13-9-17-18(10-15(13)16)25-20(4,5)24-17/h6-8,14,17-18,21-22H,9-12H2,1-5H3
charge 0 multiplicity 1
56 atoms
O  -0.581932 1.798588 -0.006695
O  -2.774656 2.079615 0.759865
O  0.337095 -2.131596 -0.540442
O  3.169533 -2.478467 -1.28936
N  3.99265 -0.388062 0.123701
C  -1.444025 1.474891 -1.172812
C  -2.914455 1.698659 -0.666047
C  -1.140811 0.028124 -1.601404
C  -3.802376 0.439993 -0.74656
C  -1.398042 2.583521 0.950283
C  -1.745097 -0.978849 -0.643448
C  -3.085046 -0.793552 -0.22778
C  -0.950437 2.226538 2.363563
C  -1.317438 4.085287 0.619213
C  -1.005221 -2.07961 -0.135786
C  -3.697536 -1.72105 0.647939
C  -1.621317 -3.029735 0.715685
C  -2.969798 -2.842735 1.09833
C  1.258823 -3.048782 0.142429
C  2.675212 -2.468015 0.078418
C  4.039376 1.11006 -0.03313
C  2.746042 -1.012754 0.635918
C  5.471776 1.442932 -0.517531
C  3.010833 1.554263 -1.102695
C  3.752707 1.838864 1.311643
H  -1.207451 2.17465 -1.999048
H  -3.391415 2.532736 -1.219784
H  -0.051531 -0.113727 -1.684822
H  -1.561593 -0.120352 -2.618799
H  -4.086821 0.302096 -1.811667
H  -4.735258 0.624528 -0.185145
H  -1.046486 1.139071 2.510825
H  0.101525 2.524204 2.515715
H  -1.578656 2.747801 3.10561
H  -0.276169 4.438926 0.714114
H  -1.658174 4.279534 -0.413225
H  -1.956275 4.661419 1.310791
H  -4.731799 -1.564025 0.973731
H  -1.0745 -3.908307 1.070848
H  -3.445761 -3.577139 1.757851
H  0.967996 -3.164966 1.207246
H  1.235801 -4.035177 -0.358442
H  3.311761 -3.135015 0.711083
H  2.669579 -1.026707 1.744919
H  1.886033 -0.448766 0.242187
H  4.815816 -0.707067 0.658253
H  5.594478 2.532789 -0.647458
H  5.677615 0.948111 -1.483356
H  6.230903 1.103158 0.214634
H  1.969273 1.466804 -0.745725
H  3.126335 0.947481 -2.0186
H  3.179733 2.61572 -1.361025
H  3.789585 2.936064 1.178148
H  4.500065 1.562333 2.080298
H  2.747581 1.578529 1.690868
H  3.755451 -1.651434 -1.312821
