program: Gaussian 09
title: 000103600
version: EM64L-G09RevD.01
frameworkgroup: C1[X(C15H18Cl2O3)]
method: RPBEPBE
basis: SDD
operation: Freq
keyword: #p
keyword: freq=noraman
keyword: PBEPBE/SDD
title: #p freq=noraman PBEPBE/SDD
converged: NO NO NO NO
title: Mulliken charges:
elementType: Cl Cl O O O C C C C C C C C C C C C C C C H H H H H H H H H H H H H H H H H H
charge: 0.012303 0.024232 -0.299445 -0.252166 -0.226603 -0.214043 -0.362105 -0.447579 0.490099 -0.436049 -0.387876 -0.299610 -0.395332 0.343890 0.200502 -0.713965 -0.708316 0.203181 -0.229912 -0.671075 0.290374 0.270208 0.270230 0.238012 0.251979 0.243032 0.252708 0.225100 0.249037 0.239973 0.257905 0.234482 0.211567 0.223109 0.233048 0.212150 0.230678 0.236274
chargesum: 0.00000
title: Mulliken charges with hydrogens summed into heavy atoms:
elementType: Cl Cl O O O C C C C C C C C C C C C C C C
charge: 0.012303 0.024232 -0.299445 -0.252166 -0.226603 0.076331 -0.362105 0.092859 0.490099 -0.198037 -0.135896 -0.056578 -0.142624 0.343890 0.200502 0.000145 -0.004362 0.203181 0.226246 0.008026
polarizability: 2.52136575e+02 -1.02649614e+01 1.77062045e+02 6.44128810e+00 9.78219867e+00 1.44751489e+02
1716.lowfreq: -27.7602 -7.0749 -0.0029 -0.0023 -0.0008 1.8364 5.0198 18.4000 23.1541
frequency: -27.7529 18.3560 23.0809 40.8763 48.0829 62.0078 70.7452 96.3999 114.2047 123.2845 161.1511 186.7779 197.0457 200.1294 238.4698 247.1289 251.2919 261.3852 282.7881 297.3921 312.3377 317.3405 347.9584 375.6930 384.8950 407.7478 425.8471 442.4970 476.7202 500.6160 526.7052 566.3373 589.5558 631.9997 670.6508 683.2905 717.3195 743.2405 751.7052 798.3691 800.1936 816.7419 827.4009 843.8923 869.2545 871.6944 926.2288 934.0013 943.3585 947.7757 970.1490 974.3163 1003.4245 1007.8820 1021.9714 1042.8394 1078.8275 1105.3516 1112.1432 1112.9976 1120.0457 1134.7363 1148.2050 1174.5626 1200.3390 1204.2549 1218.7129 1245.2031 1250.3423 1250.7388 1299.1180 1355.8698 1356.8022 1361.3730 1378.1773 1395.1901 1403.2190 1408.2578 1440.9687 1450.9798 1459.5319 1462.8706 1466.0615 1473.0053 1482.6726 1486.7759 1498.6859 1576.9199 1615.6038 1619.0260 2996.7803 3000.2186 3004.2062 3005.0521 3064.2036 3087.8383 3093.7814 3099.1614 3105.6308 3106.3408 3107.8583 3108.9030 3122.3547 3128.7092 3143.4742 3165.2297 3168.8904 3213.7380
redmass: 4.3059 4.8310 7.2986 5.4798 6.2976 3.7637 4.2368 5.8101 3.2639 2.9762 5.4028 1.2490 3.0984 2.8056 1.6598 1.8854 2.1603 2.2916 5.1538 3.2599 3.7660 3.3793 4.5273 3.2415 4.5581 2.8864 6.0223 3.8848 3.8451 4.1586 4.6527 3.8033 3.1233 6.6413 3.2035 3.9611 6.2705 3.1501 4.0714 1.8525 1.7234 1.3957 4.0906 1.5162 4.9482 5.1232 1.9533 1.5303 1.7201 1.4555 1.4035 5.1657 1.3782 2.4230 2.3059 1.4285 1.2732 3.4025 1.6345 1.7007 1.4142 1.4740 2.3757 1.4006 2.4314 3.4200 3.8870 3.5275 1.1392 1.3577 1.2784 1.5640 3.9204 2.6107 1.2199 1.2089 1.2652 3.5962 1.2348 1.0522 1.0507 1.0399 1.0558 1.0641 1.0614 1.0690 2.7190 7.4261 7.5641 8.6272 1.0362 1.0352 1.0364 1.0573 1.1066 1.0864 1.0987 1.1000 1.0567 1.0997 1.1022 1.1003 1.1007 1.0893 1.0884 1.0954 1.0957 1.1163
irintensity: 0.3997 0.4553 0.3434 0.7207 0.9430 0.1441 0.9323 0.6230 2.8100 2.6813 1.7461 0.5217 0.9780 3.2848 0.1536 2.0342 3.0910 1.7823 2.9528 2.5988 0.1296 0.9457 16.1936 0.5136 0.6285 0.1596 8.0895 2.3879 8.8830 10.5212 14.5237 2.5451 44.0059 4.9928 13.2117 54.1090 13.3097 6.3780 4.1703 6.5489 2.4619 8.2278 7.4418 34.1848 10.5016 75.1592 10.6899 5.9051 10.4264 1.0582 1.7049 14.5764 2.6938 13.7566 54.4914 43.4717 22.9852 394.3776 21.0449 18.6485 22.7586 3.6190 189.9478 37.3008 28.9849 61.8818 19.2199 16.9569 0.5294 6.7258 1.2415 2.0644 3.4842 6.0516 22.4889 37.4895 20.9710 1.5038 19.4718 4.8931 0.3511 10.6487 9.0662 5.8011 6.3212 19.6291 147.3518 2.3418 82.0465 92.3991 19.7618 12.9470 15.7258 15.8016 12.4579 5.2159 27.2507 8.1697 1.6510 15.5567 40.7447 27.9941 13.3200 12.3302 9.6267 14.4524 3.4140 2.5377
temp: 298.150 k
press: 1.00000 atm
elementType: 17 17 8 8 8 6 6 6 6 6 6 6 6 6 6 6 6 6 6 6 1 1 1 1 1 1 1 1 1 1 1 1 1 1 1 1 1 1
symmnumber: 1
zpe: 774357.6 jmol-1
zpe.correction: 0.294937 hartree
zpe.thermalcorrener: 0.315826 hartree
zpe.thermalcorrenthalpy: 0.316770 hartree
zpe.thermalcorrgfe: 0.242884 hartree
zpe.sumelectzpe: -1726.634382 hartree
zpe.sumelectthermal: -1726.613494 hartree
zpe.sumelectthermalent: -1726.612550 hartree
zpe.sumelectthermalfe: -1726.686435 hartree
dipole: 3.0164 2.0399 0.0772
dipole: 3.6422
quadrupole: -132.1646 -118.7230 -138.2921
quadrupole: -1.9342 -3.3242 3.8967
quadrupole: -2.4381 11.0036 -8.5656 -1.9342 -3.3242 3.8967
hfenergy: -1726.9293195 hartree
pointgroup: C01 [X(C15H18Cl2O3)]
dipole: -1.1286929 0.88022 0.0682868 debye
polarizability: 250.8098884|2.6051896|178.8714618|17.7323402|-1.6424661|144.2687588 unknown
InChI: InChI=1S/C15H18Cl2O3/c1-4-19-13(18)14(2,3)20-11-7-5-10(6-8-11)12-9-15(12,16)17/h5-8,12H,4,9H2,1-3H3
charge 0 multiplicity 1
38 atoms
Cl 4.677502 -1.627265 -0.610216
Cl 6.423082 0.027347 1.272666
O  -1.780366 -1.137326 0.696057
O  -3.650353 0.919565 0.082448
O  -2.966167 0.692845 -2.127763
C  3.661644 0.729291 0.802904
C  4.872506 -0.018716 0.263468
C  4.447657 1.247445 -0.445252
C  2.248556 0.223554 0.705297
C  1.242068 1.032449 0.123851
C  1.879946 -1.029116 1.258321
C  -0.103635 0.609472 0.083521
C  0.542428 -1.469453 1.208867
C  -0.45264 -0.654117 0.619272
C  -2.63461 -1.201704 -0.53595
C  -1.892366 -1.903626 -1.683643
C  -3.869586 -1.989826 -0.060449
C  -3.076496 0.222142 -0.971541
C  -4.131208 2.303354 -0.225329
C  -4.733139 2.853979 1.062719
H  3.881456 1.281037 1.727491
H  3.971949 1.124947 -1.423374
H  5.078657 2.133768 -0.335681
H  1.512436 2.007802 -0.298024
H  2.644039 -1.665688 1.716527
H  -0.865238 1.265458 -0.347528
H  0.24689 -2.437467 1.625703
H  -1.646401 -2.936153 -1.38237
H  -0.960913 -1.375458 -1.946669
H  -2.525199 -1.929211 -2.586382
H  -4.356821 -1.462444 0.774645
H  -3.549542 -2.988022 0.28271
H  -4.593993 -2.111314 -0.885463
H  -3.268758 2.897836 -0.579982
H  -4.86471 2.239488 -1.049501
H  -5.100867 3.882349 0.893148
H  -5.580987 2.2332 1.399598
H  -3.980619 2.880376 1.869004
