program: Gaussian 09
title: 000103531
version: EM64L-G09RevD.01
frameworkgroup: C1[X(C11H11NS3)]
method: RPBEPBE
basis: SDD
operation: Freq
keyword: #p
keyword: freq=noraman
keyword: PBEPBE/SDD
title: #p freq=noraman PBEPBE/SDD
converged: YES YES NO NO
title: Mulliken charges:
elementType: S S S N C C C C C C C C C C C H H H H H H H H H H H
charge: 0.299627 0.200625 -0.011286 -0.211870 0.583388 -0.378243 0.049368 -0.340531 -0.639710 -0.290310 -0.224001 -0.246313 -0.041808 -0.650026 -0.827258 0.246701 0.249257 0.241429 0.249476 0.247223 0.230702 0.223095 0.234120 0.282309 0.241823 0.282212
chargesum: 0.00000
title: Mulliken charges with hydrogens summed into heavy atoms:
elementType: S S S N C C C C C C C C C C C
charge: 0.299627 0.200625 -0.011286 -0.211870 0.583388 -0.378243 0.049368 -0.093829 0.100451 -0.043087 0.006701 -0.012193 0.181287 -0.650026 -0.020914
polarizability: 3.82128112e+02 -9.13138682e-01 1.83967149e+02 -8.96074885e-03 -1.10857691e-01 7.28110147e+01
1716.lowfreq: -99.9986 -12.0112 -3.1302 0.0019 0.0024 0.0028 3.7254 40.6923 60.9320
frequency: -99.9884 40.6919 60.9224 83.8815 95.0407 110.6162 122.0885 163.8985 198.5586 213.2324 214.7616 237.4555 293.7260 324.7946 376.5386 396.6852 439.0190 475.4857 511.2142 514.3984 524.6657 542.0614 565.9206 644.3918 666.3279 677.5618 695.5946 726.9832 753.0356 778.6613 825.1724 848.4591 868.5281 932.1932 976.6496 978.3186 984.1975 1019.6642 1023.9145 1035.5031 1114.2260 1121.2863 1129.5684 1173.7428 1240.7819 1284.4451 1297.3327 1325.1664 1342.9187 1370.9574 1405.6369 1428.9978 1440.9833 1443.9106 1446.1693 1464.5839 1476.1824 1487.3476 1564.0510 1596.2939 1600.7606 2991.0275 3013.7291 3068.3125 3118.6835 3137.4553 3140.1030 3140.8879 3148.1647 3155.5614 3160.6689 3173.5285
redmass: 1.1139 5.5265 4.7802 5.7859 6.0171 1.0653 2.6142 4.6670 6.7085 9.1816 6.2511 4.8668 3.7929 4.9137 6.8485 9.1990 3.2028 9.6980 7.4454 6.3889 3.4812 5.8886 3.9901 7.0757 6.7661 7.0507 7.2467 2.8086 1.4861 1.5822 4.1999 1.3643 6.2864 1.3778 1.3154 1.1816 1.2796 3.6568 6.4897 2.4476 1.3089 1.8152 1.5037 1.0712 2.5370 2.0114 1.8413 2.6310 1.1646 3.2622 8.1252 1.0507 1.3813 2.0836 1.0569 2.3938 1.0406 1.1298 5.8142 6.8785 7.2845 1.0384 1.0282 1.1024 1.0877 1.0855 1.1051 1.1037 1.0899 1.0943 1.0947 1.1005
irintensity: 0.0064 0.5371 2.0788 2.3873 0.9017 0.0940 1.9615 0.2852 4.7147 5.8635 2.7454 3.5401 1.0133 0.0127 10.7573 2.2928 7.4849 17.4343 4.0988 19.4838 4.3866 15.6650 3.5264 1.9957 3.8679 0.1427 33.8643 14.2673 91.2703 27.7763 77.5110 0.1216 155.5553 2.1982 0.0117 8.6520 4.3645 29.6412 0.7653 6.4606 0.4577 25.1753 4.9250 2.4445 89.5779 82.2577 20.9193 35.5201 5.4410 4.4862 9.2428 16.1849 4.5743 0.5956 29.2861 102.5134 15.9696 22.7609 1004.1560 64.4056 8.2914 44.5373 22.7668 18.8064 6.1378 1.6685 10.1780 14.9175 4.1008 8.6612 16.3711 28.6936
temp: 298.150 k
press: 1.00000 atm
elementType: 16 16 16 7 6 6 6 6 6 6 6 6 6 6 6 1 1 1 1 1 1 1 1 1 1 1
symmnumber: 1
zpe: 502098.3 jmol-1
zpe.correction: 0.191239 hartree
zpe.thermalcorrener: 0.205869 hartree
zpe.thermalcorrenthalpy: 0.206813 hartree
zpe.thermalcorrgfe: 0.148547 hartree
zpe.sumelectzpe: -1673.624095 hartree
zpe.sumelectthermal: -1673.609465 hartree
zpe.sumelectthermalent: -1673.608521 hartree
zpe.sumelectthermalfe: -1673.666787 hartree
dipole: 3.7647 3.6138 0.0108
dipole: 5.2184
quadrupole: -93.7380 -100.6569 -116.3538
quadrupole: 0.9837 -0.0202 0.0249
quadrupole: 9.8449 2.9260 -12.7709 0.9837 -0.0202 0.0249
hfenergy: -1673.8153344 hartree
pointgroup: C01 [X(C11H11N1S3)]
dipole: 1.5859281 1.2972744 -0.1307132 debye
dipolederiv: 0.4743672 0.0970619 -0.032394 0.7469885 -0.2029501 -0.0653734 -0.0335534 -0.0088367 0.1050508 -0.908444 0.3008643 0.0736189 0.7157997 -0.3668743 -0.0619946 0.0712261 -0.0257874 -0.0615987 -0.6726932 -0.0128929 0.0455254 -0.3154312 -0.7311836 0.0275949 0.0452799 0.0019989 -0.1526879 -1.6649158 0.0255556 0.1332902 -0.3687467 -0.6533084 0.0310158 0.1313302 -0.0045122 -0.1305834 0.5593385 -0.3186697 -0.0412787 -0.6717299 0.0758037 0.0576443 -0.0414635 0.0273606 0.1003625 0.0582765 0.0205762 -0.0137699 0.2315229 -0.1713261 -0.0202565 -0.0124106 -0.0023144 -0.1005427 2.2345408 0.0959638 -0.1904526 -0.4461613 0.4922141 0.039409 -0.1890617 -0.0073728 0.0273395 0.004136 0.1280232 -0.0171585 -0.1134472 0.0447121 0.0098224 -0.0176757 -0.0110578 -0.1972324 0.0437957 0.0591235 0.0159295 0.2387962 0.5016538 -0.0209104 0.0161531 -0.0058554 0.2244746 0.1435157 -0.0046922 -0.0218012 -0.2020668 0.1440898 0.0180039 -0.0221381 0.001033 -0.1085054 -0.037687 0.0111135 -0.0102733 0.3372 0.0472619 -0.028667 -0.0101067 -0.0006485 -0.1555978 -0.2952953 -0.0390679 0.0100867 -0.211294 -0.0240172 0.0183961 0.0098125 0.0037277 -0.179171 -2.2765583 -0.098425 0.178092 0.1042036 -0.1597165 -0.0095306 0.1792689 0.0077971 -0.2272937 2.0864253 -0.2593143 -0.1962052 0.1177977 0.9406344 -0.0105573 -0.1951704 0.021522 -0.171 0.1553652 0.0023039 -0.0098847 0.0145869 0.0282554 -0.0013722 -0.0085393 -0.0004276 0.0463622 0.0874279 0.0003357 0.0072147 -0.0504138 -0.0838769 0.0041114 0.0073764 -0.0002639 0.1706526 0.0088525 -0.1149347 -0.1011687 -0.0604543 0.0059119 -0.0050278 -0.0964363 -0.0586744 -0.0250625 -0.0298881 0.1324298 0.0160687 0.0283595 0.0932201 -0.0025009 0.0143376 -0.0113131 0.1198186 0.0449519 -0.101015 0.0857028 -0.0598164 0.0024905 0.0174987 0.0826807 0.0807477 -0.0595844 0.1077548 -0.0611802 0.0044016 0.0110031 -0.0547104 -0.0014234 0.004355 0.0048586 0.159668 -0.1216665 -0.0581022 0.0244527 -0.0709859 0.0663939 0.0059783 0.0243652 0.0048736 0.1598626 0.0677453 0.0225888 0.0107903 0.0061265 -0.0876027 -0.000326 0.0106776 -0.001629 0.1909422 -0.075584 0.1010388 0.0213626 0.1026922 0.0096277 -0.0091602 0.0213744 -0.009044 0.1676354 0.0593922 -0.0063972 0.0140754 -0.1263234 0.0213615 -0.086923 0.0269759 -0.0567295 -0.0200026 -0.1019966 0.0741114 0.0202418 0.1510221 0.0398083 -0.0129971 0.0202441 -0.0063034 0.1284191 0.0488435 0.0036008 -0.0264665 -0.1092279 0.0221272 0.1075456 -0.0389018 0.0568508 -0.0117258 unknown
polarizability: 378.3870601|-16.8091693|185.4113348|-26.4930484|1.5425187|75.1078811 unknown
InChI: InChI=1S/C11H11NS3/c1-12-8-5-3-4-6-9(8)15-10(12)7-11(13)14-2/h3-7H,1-2H3
charge 0 multiplicity 1
26 atoms
S  -0.115926 -1.292488 0.124005
S  -4.411702 1.468297 0.496419
S  -3.150278 -1.388831 0.389963
N  0.717957 1.245472 0.05744
C  1.908683 0.491572 -0.048178
C  1.677336 -0.905999 -0.03124
C  -0.467184 0.504011 0.157181
C  3.223101 1.000644 -0.161048
C  0.785045 2.715065 0.05966
C  2.737709 -1.821254 -0.124563
C  4.290907 0.080007 -0.255039
C  4.056608 -1.316917 -0.237346
C  -1.746976 1.044038 0.266697
C  -2.973365 0.314848 0.373007
C  -5.848262 0.277539 0.626817
H  3.418421 2.076899 -0.17657
H  1.402361 3.065223 0.906662
H  -0.216274 3.150506 0.15988
H  1.229743 3.07736 -0.884906
H  2.552534 -2.900089 -0.110706
H  5.315469 0.456726 -0.342992
H  -1.835298 2.136944 0.2732
H  4.898199 -2.013108 -0.311206
H  -5.884883 -0.35871 -0.269696
H  -6.749632 0.90585 0.70474
H  -5.726693 -0.353507 1.51952
