program: Gaussian 09
title: 000103543
version: EM64L-G09RevD.01
frameworkgroup: C1[X(C15H29BrO2)]
method: RPBEPBE
basis: SDD
operation: Freq
keyword: #p
keyword: freq=noraman
keyword: PBEPBE/SDD
title: #p freq=noraman PBEPBE/SDD
converged: YES YES NO NO
title: Mulliken charges:
elementType: Br O O C C C C C C C C C C C C C C C H H H H H H H H H H H H H H H H H H H H H H H H H H H H H
charge: -0.051666 -0.248992 -0.281118 -0.425561 0.001983 -0.381046 -0.405452 -0.384777 -0.378512 -0.382914 -0.384866 -0.404879 -0.378072 -0.307748 -0.249887 -0.376759 -0.313516 -0.694568 0.216489 0.201751 0.205051 0.195109 0.196259 0.221830 0.213901 0.196048 0.194620 0.192528 0.191463 0.195461 0.194261 0.206586 0.198946 0.205334 0.208605 0.197382 0.198529 0.213635 0.200410 0.212196 0.186333 0.198422 0.197766 0.226898 0.226623 0.278049 0.277864
chargesum: 0.00000
title: Mulliken charges with hydrogens summed into heavy atoms:
elementType: Br O O C C C C C C C C C C C C C C C
charge: -0.051666 -0.248992 -0.281118 -0.007321 0.207034 0.010322 0.030279 0.005890 0.005478 0.006808 0.020666 0.009060 0.017840 0.106297 0.148642 0.019429 0.140005 -0.138655
polarizability: 2.57558243e+02 2.83280394e+00 1.49310860e+02 1.19498806e+01 1.47088844e+00 1.51348898e+02
1716.lowfreq: -2.2688 -0.0008 -0.0006 0.0008 1.9724 7.8284 17.5342 22.5932 24.7871
frequency: 11.3216 17.6251 24.4556 38.7797 40.8536 53.0430 65.1469 83.0503 91.1510 100.3509 112.5967 120.5848 134.1245 148.6224 151.3233 156.2087 193.9523 205.5933 241.5080 287.4887 306.7903 353.2948 378.9747 410.8370 424.2701 471.5284 484.9012 510.2172 542.6678 617.1563 668.5011 721.1069 726.9589 738.9403 755.3996 768.0701 785.7723 797.9260 831.9225 848.4240 866.8311 879.3879 890.8393 938.3795 953.1722 967.4455 984.8317 992.9855 1006.9748 1009.9029 1024.9558 1030.1034 1039.6257 1053.2327 1054.9747 1065.9045 1074.3006 1080.1104 1082.3669 1103.4554 1111.5822 1124.4868 1151.3650 1173.5373 1182.8754 1191.5970 1199.1159 1219.4881 1223.2016 1248.4108 1250.9817 1255.4647 1269.5008 1271.5326 1276.3480 1280.5057 1284.0125 1287.6452 1296.3816 1298.0226 1303.4987 1315.3857 1327.6660 1335.7897 1343.1651 1347.6428 1349.5851 1352.9161 1356.6681 1357.9851 1364.8491 1386.0386 1446.6345 1450.3379 1455.1662 1457.9658 1460.2148 1460.2636 1464.6412 1465.8109 1469.6584 1475.9214 1477.1117 1482.7859 1487.9240 1493.4089 2932.2679 2951.9780 2952.5759 2955.2853 2958.1629 2962.5667 2968.3099 2976.9471 2981.5339 2985.5554 2985.5929 2986.0608 2991.8767 2995.9475 2997.3868 2999.8391 3003.1734 3006.3534 3011.9116 3027.7083 3040.9902 3041.4242 3046.6244 3055.1908 3056.3685 3060.1850 3070.6457 3080.8153 3131.7021
redmass: 5.5886 4.1659 3.9862 2.0263 2.6615 3.6578 2.6286 2.2081 2.8435 4.5553 3.1960 1.9433 2.9517 2.5529 2.0094 2.7437 4.0378 3.6166 3.2454 3.8034 2.4381 2.2686 3.6001 3.1992 3.9805 3.2840 3.2439 2.2792 3.6021 4.8601 3.1758 1.0616 1.0750 1.0864 1.1223 4.0157 1.1786 1.8374 1.2242 2.8066 2.2890 2.4534 1.2445 1.6585 1.2249 6.0029 4.9969 4.9143 2.4995 1.1667 2.7707 3.8819 4.0505 1.9830 1.0512 2.7642 2.9679 2.2882 2.3487 3.2540 2.0846 2.2830 1.4144 1.2825 1.4915 1.6636 1.2065 1.4454 1.2406 1.3240 1.2635 1.2401 1.1820 1.2188 1.0765 1.2682 1.0746 1.1014 1.1105 1.1084 1.2671 1.3519 1.2240 1.3745 1.4149 1.4634 1.5135 1.4272 1.6349 1.5992 1.2739 1.4701 1.0902 1.1037 1.0890 1.0861 1.0739 1.0743 1.0669 1.0758 1.0871 1.0964 1.0910 1.0989 1.1000 1.0885 1.0614 1.0587 1.0587 1.0593 1.0589 1.0591 1.0585 1.0659 1.0598 1.0796 1.0964 1.0597 1.0983 1.0609 1.0594 1.1000 1.0981 1.0696 1.1038 1.1051 1.1050 1.1003 1.0563 1.1045 1.1013 1.1042 1.1025 1.1007 1.1112
irintensity: 0.4038 0.1708 0.2081 0.3094 0.5839 0.9145 0.4651 0.2124 0.2500 0.2248 0.7549 0.4310 0.6624 1.4386 0.0563 2.5735 5.5645 8.0694 2.6941 0.6588 5.8163 0.6418 6.8966 0.1995 7.6693 0.7774 6.0989 1.0147 2.4112 39.9693 1.1262 14.1825 0.6837 9.3330 0.4251 26.4602 1.3696 19.0012 0.4609 14.4689 18.6940 54.9161 0.8526 32.0263 1.1217 129.6987 2.6857 77.3346 19.8458 1.1024 53.1843 2.0286 10.3719 31.4045 1.5029 2.9971 14.4929 1.5708 2.3258 5.6172 26.5092 21.7762 1.5176 6.7216 22.6402 0.0329 12.2316 0.4243 29.5099 0.4020 11.2899 10.1155 2.5689 5.9641 0.1097 9.3106 0.2045 0.2335 0.2489 0.2228 45.6626 0.6018 5.9478 12.6952 1.5213 3.1031 5.5324 1.8589 0.0961 0.1690 0.9241 1.0695 7.9204 2.7117 10.6526 7.7916 0.2537 0.0010 0.5414 0.5813 0.1877 5.1845 6.8322 0.1061 21.7752 13.8031 45.4265 1.1442 1.2684 0.7087 5.1710 19.1350 155.7781 43.0462 39.8635 17.8703 0.0741 56.3137 1.5263 45.1709 27.0553 1.4977 25.3006 54.4978 1.2524 0.1957 85.2027 32.5394 24.8583 82.3552 88.3433 84.9002 43.2683 49.7185 19.0110
temp: 298.150 k
press: 1.00000 atm
elementType: 35 8 8 6 6 6 6 6 6 6 6 6 6 6 6 6 6 6 1 1 1 1 1 1 1 1 1 1 1 1 1 1 1 1 1 1 1 1 1 1 1 1 1 1 1 1 1
symmnumber: 1
zpe: 1094710.4 jmol-1
zpe.correction: 0.416953 hartree
zpe.thermalcorrener: 0.439032 hartree
zpe.thermalcorrenthalpy: 0.439976 hartree
zpe.thermalcorrgfe: 0.359505 hartree
zpe.sumelectzpe: -751.400089 hartree
zpe.sumelectthermal: -751.378011 hartree
zpe.sumelectthermalent: -751.377067 hartree
zpe.sumelectthermalfe: -751.457538 hartree
dipole: 2.6878 0.2625 1.4780
dipole: 3.0786
quadrupole: -158.3420 -117.5192 -125.8120
quadrupole: 2.1596 -0.7761 1.3251
quadrupole: -24.4509 16.3719 8.0790 2.1596 -0.7761 1.3251
hfenergy: -751.8170426 hartree
pointgroup: C01 [X(C15H29Br1O2)]
dipole: 1.0523724 -0.1860485 0.5700146 debye
polarizability: 257.3464403|-4.0270026|148.6076861|12.5351581|-0.1227808|152.2638746 unknown
InChI: InChI=1S/C15H29BrO2/c16-12-8-5-3-1-2-4-6-9-13-17-15-11-7-10-14-18-15/h15H,1-14H2
charge 0 multiplicity 1
47 atoms
Br -10.425397 0.439303 -0.192827
O  5.442481 0.962081 -1.054848
O  3.978153 -0.690981 -0.055221
C  6.355249 -1.061808 0.087142
C  5.229963 -0.462618 -0.770479
C  -1.010243 -0.411012 0.218607
C  6.584447 -0.23467 1.373823
C  -2.343075 -0.154394 -0.51974
C  0.229419 -0.26872 -0.692954
C  -3.578865 -0.259258 0.402513
C  6.811379 1.253362 1.014959
C  1.555888 -0.545353 0.051407
C  -4.912868 -0.007217 -0.335459
C  5.632678 1.772744 0.17358
C  2.779276 -0.348742 -0.84746
C  -6.144362 -0.08894 0.596638
C  -7.473806 0.170942 -0.159677
C  -8.670905 0.091526 0.788285
H  6.096822 -2.108851 0.326258
H  7.27847 -1.067532 -0.52359
H  5.182471 -0.913466 -1.782676
H  -0.920012 0.296169 1.069363
H  -1.025172 -1.428972 0.660918
H  5.695903 -0.325382 2.027217
H  7.449541 -0.636925 1.932843
H  -2.44548 -0.877683 -1.355489
H  -2.31702 0.854244 -0.982893
H  0.13393 -0.964726 -1.55238
H  0.249896 0.755122 -1.121929
H  -3.602306 -1.265364 0.871131
H  -3.476082 0.468976 1.234016
H  7.749823 1.362717 0.436537
H  6.90832 1.869434 1.930176
H  1.644738 0.126643 0.927384
H  1.561271 -1.581558 0.442059
H  -4.883552 0.992822 -0.815614
H  -5.024871 -0.74493 -1.156652
H  5.804619 2.795602 -0.199977
H  4.698168 1.752484 0.771129
H  2.855028 0.698985 -1.202313
H  2.728066 -1.014014 -1.738375
H  -6.175805 -1.089843 1.07484
H  -6.030606 0.649597 1.416965
H  -7.591644 -0.570583 -0.972354
H  -7.441839 1.169254 -0.635751
H  -8.799428 -0.90824 1.232121
H  -8.641762 0.859475 1.577147
