program: Gaussian 09
title: 000103547
version: EM64L-G09RevD.01
frameworkgroup: C1[X(C19H36O2)]
method: RPBEPBE
basis: SDD
operation: Freq
keyword: #pfreq=noraman
keyword: PBEPBE/SDD
title: #p freq=noraman PBEPBE/SDD
converged: YES YES NO NO
title: Mulliken charges:
elementType: O O C C C C C C C C C C C C C C C C C C C H H H H H H H H H H H H H H H H H H H H H H H H H H H H H H H H H H H H
charge: -0.248965 -0.291048 -0.429750 0.008920 -0.404160 -0.374184 -0.385214 -0.371133 -0.408586 -0.401488 -0.366746 -0.315297 -0.251118 -0.392252 -0.474574 -0.182540 -0.450121 -0.194916 -0.349060 -0.345024 -0.693899 0.215896 0.201414 0.204859 0.217421 0.212403 0.199464 0.183184 0.205512 0.206327 0.226909 0.182956 0.193442 0.191356 0.187723 0.205425 0.184001 0.219033 0.213601 0.206575 0.193133 0.210429 0.206748 0.198080 0.203175 0.198518 0.218135 0.212240 0.185117 0.222109 0.188847 0.204842 0.193943 0.192405 0.209737 0.210976 0.215222
chargesum: 0.00000
title: Mulliken charges with hydrogens summed into heavy atoms:
elementType: O O C C C C C C C C C C C C C C C C C C C
charge: -0.248965 -0.291048 -0.012440 0.213778 0.025663 0.008465 0.026626 0.038732 -0.023789 -0.008339 0.036288 0.104879 0.152444 0.012576 -0.072881 0.035595 -0.052764 0.027193 0.044629 0.041324 -0.057963
polarizability: 2.43453520e+02 1.64213001e+01 2.15111954e+02 -1.00511522e+01 -6.39355408e-01 1.76834153e+02
1716.lowfreq: -9.3708 -0.0008 -0.0007 -0.0006 1.5166 5.5492 16.0161 17.4852 20.7766
frequency: 15.6094 16.7822 20.3065 30.8391 33.6214 40.5282 50.2554 68.8559 74.2404 86.6860 106.2424 115.3304 117.6157 138.2783 164.7441 181.8518 203.8010 207.5043 222.6532 224.5056 241.1759 250.1906 261.7115 300.1844 307.5451 312.8442 358.1074 375.9154 399.0994 410.6201 466.0618 471.8559 499.2839 500.8032 540.0393 549.0995 657.4789 709.9226 726.7501 740.9730 756.8637 767.6595 782.1861 796.6374 803.1745 826.5987 840.6306 848.3044 870.7316 873.5517 883.5456 893.0313 916.7444 919.1743 936.2285 943.4796 950.4904 973.4717 985.7839 1004.5193 1008.7587 1021.2057 1022.5467 1037.9550 1040.8542 1052.1447 1064.2611 1071.8429 1085.9141 1101.2792 1105.2140 1108.9005 1110.9493 1115.3445 1119.1916 1136.1034 1154.0354 1171.8586 1174.5238 1183.5973 1195.4316 1209.2540 1212.5465 1244.5153 1248.1840 1254.8207 1262.4546 1268.0573 1270.3560 1276.4473 1282.1309 1286.1249 1288.0590 1293.5802 1295.5739 1304.0477 1308.0717 1315.6006 1327.0887 1339.1247 1341.3828 1341.7432 1344.9841 1348.7865 1349.7476 1351.7257 1360.1225 1361.3968 1364.1644 1378.0679 1388.5943 1447.1149 1450.5717 1455.3505 1456.7413 1458.6255 1460.7665 1462.3268 1465.6562 1466.2434 1470.1563 1474.3934 1475.8340 1477.2820 1477.6965 1483.7900 1484.2487 1486.1238 1683.4545 2938.8798 2941.8946 2949.7253 2951.3908 2956.7623 2959.1830 2961.7039 2967.1592 2968.5094 2972.2907 2972.8533 2974.9408 2976.4342 2981.8482 2983.5542 2989.7146 2998.5552 2999.1781 3003.8172 3005.9131 3007.6265 3010.2832 3012.7704 3021.0559 3026.7821 3037.8362 3039.1077 3039.8485 3051.6940 3052.1697 3053.1518 3066.0396 3069.2730 3069.6306 3071.0460 3080.0321
redmass: 3.3151 3.8216 2.8354 3.7992 4.2812 2.7994 3.5135 3.0637 2.0888 2.7654 2.4476 2.1907 2.8144 2.1589 2.5568 2.3645 3.0140 2.6291 2.3356 1.2259 2.5679 2.1458 3.1796 2.8054 1.9683 1.9509 2.5698 2.0882 2.5470 3.8899 2.7840 3.0444 2.4261 2.4139 2.7042 3.1425 2.7853 1.1901 1.0827 1.3440 1.4341 3.3061 1.6002 1.3352 1.6160 1.5927 2.1194 2.8397 2.2287 2.1220 1.9978 1.8740 1.5482 1.6731 1.7296 2.1310 1.8800 1.1031 2.1571 2.7400 2.8138 2.3189 1.7128 2.1420 2.2923 1.9281 1.6649 2.5433 1.9795 2.2256 2.0330 2.1583 2.0915 2.1570 2.0543 1.9371 1.3832 1.3231 1.6939 1.4916 1.4143 1.3096 1.3347 1.3034 1.3011 1.2398 1.2798 1.2105 1.2098 1.2159 1.2010 1.1563 1.1032 1.1571 1.1673 1.2759 1.2523 1.3344 1.2140 1.4714 1.4263 1.4208 1.4688 1.5657 1.4098 1.4442 1.5182 1.5863 1.2839 1.3869 1.2147 1.0908 1.0821 1.0896 1.0916 1.0824 1.0844 1.0766 1.0741 1.0800 1.0831 1.0887 1.0734 1.0428 1.0904 1.0822 1.0979 1.0813 6.6488 1.0598 1.0626 1.0607 1.0597 1.0640 1.0589 1.0623 1.0607 1.0606 1.0365 1.0623 1.0617 1.0660 1.0597 1.0804 1.0610 1.0960 1.0978 1.0972 1.0686 1.1001 1.0979 1.0980 1.0965 1.0997 1.1031 1.1016 1.0998 1.1005 1.1011 1.0947 1.0893 1.0997 1.1022 1.0994 1.1005
irintensity: 0.0051 0.0012 0.0027 0.0786 0.0342 0.0760 0.2614 0.0927 0.0814 0.9282 0.2095 0.2857 3.2145 0.2928 0.7204 0.4777 7.6645 0.5174 2.9756 0.1975 0.8203 1.9249 1.0107 0.3124 2.3496 1.2936 0.4357 0.2433 0.6284 10.0899 1.2025 2.8930 0.4983 3.0048 2.7142 1.8600 0.7910 11.0851 7.9846 9.5648 10.3376 18.4974 1.1773 1.0476 7.9250 0.9119 1.9228 12.6820 5.1359 19.4517 2.2055 15.2526 17.1160 7.0654 25.0247 88.6057 29.7993 49.1628 14.8903 44.6058 2.7695 30.8248 2.0078 41.4300 13.7237 24.3711 2.8633 0.3168 19.7183 5.1318 4.0648 24.9239 0.5078 4.6612 8.1180 3.5293 3.2266 3.7082 3.5401 17.1198 1.0124 4.1718 4.9420 2.0262 2.0302 6.4123 1.2493 0.0983 5.9604 0.7087 1.6656 0.8754 1.5715 0.2458 1.5040 25.1378 0.7607 0.7340 6.5208 1.4837 0.6840 0.2151 4.9483 2.0849 2.2264 2.7124 0.7866 1.5156 0.5792 3.1141 11.3929 5.6033 4.8229 13.3902 11.7513 4.8020 5.3188 4.4608 0.1877 5.8601 0.7216 3.8909 10.0237 12.0124 26.0511 7.0912 5.0231 17.9939 0.0741 57.0414 30.1807 28.4114 21.6152 13.9842 6.7995 20.4729 77.2070 83.3940 56.5138 46.2341 64.2782 36.8401 32.1949 46.7279 45.6972 9.0273 13.2465 15.7468 72.9805 11.7068 3.6276 10.6351 69.8268 6.2942 49.4838 96.8801 29.8590 106.3160 49.9468 40.7785 50.0163 120.8659 29.4155 56.1151 48.4790
temp: 298.150 k
press: 1.00000 atm
elementType: 8 8 6 6 6 6 6 6 6 6 6 6 6 6 6 6 6 6 6 6 6 1 1 1 1 1 1 1 1 1 1 1 1 1 1 1 1 1 1 1 1 1 1 1 1 1 1 1 1 1 1 1 1 1 1 1 1
symmnumber: 1
zpe: 1351005.1 jmol-1
zpe.correction: 0.514571 hartree
zpe.thermalcorrener: 0.539984 hartree
zpe.thermalcorrenthalpy: 0.540928 hartree
zpe.thermalcorrgfe: 0.454531 hartree
zpe.sumelectzpe: -894.302594 hartree
zpe.sumelectthermal: -894.277181 hartree
zpe.sumelectthermalent: -894.276236 hartree
zpe.sumelectthermalfe: -894.362633 hartree
dipole: -0.3750 0.4581 -0.1433
dipole: 0.6091
quadrupole: -129.1509 -134.7131 -132.5040
quadrupole: 3.4317 -2.9658 4.1906
quadrupole: 2.9718 -2.5905 -0.3814 3.4317 -2.9658 4.1906
hfenergy: -894.8171642 hartree
pointgroup: C01 [X(C19H36O2)]
dipole: 0.1508089 0.1767132 0.058725 debye
polarizability: 242.9320896|-16.9955837|215.8375782|-9.385651|0.833793|176.6299591 unknown
InChI: InChI=1S/C19H36O2/c1-2-3-4-5-6-7-8-9-10-11-12-14-17-20-19-16-13-15-18-21-19/h5-6,19H,2-4,7-18H2,1H3
charge 0 multiplicity 1
57 atoms
O  -1.774515 -3.336008 -0.943488
O  -2.493174 -1.71846 0.71352
C  -0.744061 -3.25455 1.328368
C  -2.013977 -3.076095 0.481759
C  0.425995 -2.412053 0.768779
C  -3.438399 2.4675 -0.190325
C  0.639918 -2.728016 -0.730833
C  -3.152862 0.971793 -0.452266
C  -2.532334 3.437748 -0.991024
C  -4.123504 0.039759 0.306647
C  -1.012205 3.299349 -0.720208
C  -0.673372 -2.512545 -1.502772
C  -3.816903 -1.448047 0.1094
C  -0.60934 3.548643 0.750157
C  0.927463 3.511838 0.982404
C  1.538944 2.145268 0.74577
C  3.185851 0.508266 -0.31654
C  2.565265 1.87313 -0.102529
C  4.69945 0.46511 0.026327
C  5.338724 -0.914622 -0.251786
C  6.841624 -0.96175 0.098739
H  -0.973661 -2.976402 2.372562
H  -0.474188 -4.327933 1.311297
H  -2.801752 -3.813269 0.739368
H  0.188139 -1.337222 0.887711
H  1.348033 -2.614033 1.345446
H  -3.339343 2.670321 0.895577
H  -4.497617 2.682223 -0.444559
H  0.966602 -3.779642 -0.851448
H  1.42829 -2.079994 -1.16071
H  -2.119396 0.719312 -0.149038
H  -3.223683 0.769308 -1.542345
H  -2.716135 3.283223 -2.074682
H  -2.842286 4.48009 -0.767297
H  -5.164687 0.228295 -0.02764
H  -4.087888 0.269473 1.390306
H  -0.470678 4.023942 -1.363557
H  -0.660313 2.296468 -1.03068
H  -0.598046 -2.838203 -2.553327
H  -0.965867 -1.442758 -1.471107
H  -4.57765 -2.083745 0.613137
H  -3.791366 -1.716131 -0.966182
H  -1.087025 2.792927 1.406006
H  -0.999046 4.536065 1.073664
H  1.127771 3.822174 2.030116
H  1.420593 4.259282 0.329003
H  1.098205 1.316284 1.326042
H  2.649157 -0.245498 0.293497
H  3.065298 0.204676 -1.379643
H  3.00571 2.70084 -0.683169
H  5.231924 1.24133 -0.561817
H  4.83758 0.732363 1.093196
H  4.797129 -1.690082 0.328209
H  5.197778 -1.172232 -1.321746
H  7.409366 -0.218197 -0.49212
H  7.005328 -0.733539 1.168842
H  7.275339 -1.95807 -0.105314
