program: Gaussian 09
title: 000103502
version: EM64L-G09RevD.01
frameworkgroup: C1[X(C10H16O)]
method: RPBEPBE
basis: SDD
operation: Freq
keyword: #pfreq=noraman
keyword: PBEPBE/SDD
title: #p freq=noraman PBEPBE/SDD
converged: YES YES NO NO
title: Mulliken charges:
elementType: O C C C C C C C C C C H H H H H H H H H H H H H H H H
charge: -0.193364 -0.122004 -0.462768 -0.425093 -0.498317 0.111180 -0.513980 -0.179092 -0.176534 -0.438389 -0.669979 0.245308 0.205091 0.236990 0.224793 0.211459 0.238851 0.253034 0.213000 0.239782 0.222415 0.219290 0.206587 0.205493 0.219327 0.216124 0.210794
chargesum: 0.00000
title: Mulliken charges with hydrogens summed into heavy atoms:
elementType: O C C C C C C C C C C
charge: -0.193364 0.123304 -0.020688 0.011159 -0.006432 0.111180 -0.061197 0.043323 0.042756 -0.026308 -0.023733
polarizability: 1.42529615e+02 -5.09441659e+00 9.98531523e+01 -2.84376242e+00 1.51443053e+00 8.54072657e+01
1716.lowfreq: -14.0794 -0.5374 -0.0006 -0.0005 -0.0002 13.4434 35.1394 36.2767 69.9810
frequency: 34.3539 35.9390 69.8922 96.1624 116.8788 171.4133 186.0188 211.5014 247.2623 310.5395 350.7841 404.5777 469.3634 489.6447 543.9169 554.0067 609.9717 721.6975 773.8837 797.6133 821.9815 862.1362 886.1221 903.9001 929.1744 942.7291 972.2704 1000.6301 1008.0377 1027.6955 1056.3490 1068.3566 1101.5460 1119.2569 1149.3996 1152.3301 1167.9923 1196.5647 1207.0447 1243.4320 1248.9061 1268.2676 1273.8341 1285.5441 1295.2365 1302.0980 1309.2574 1317.9662 1340.8365 1385.9426 1428.2463 1458.9101 1462.9154 1472.6969 1474.4118 1480.8903 1483.9329 1652.2684 1686.3181 2935.2197 2964.4276 2968.1369 2976.3132 2987.5221 2990.5742 3001.4722 3023.4298 3028.7802 3058.3601 3066.2911 3066.9155 3072.6754 3074.3301 3080.5743 3081.8755
redmass: 3.5028 2.8849 2.5208 2.8515 2.3262 3.1414 1.7752 1.5125 1.9823 2.9466 2.3219 2.3868 3.3440 2.4340 2.4728 3.7668 2.7401 2.4976 1.2408 1.5699 1.8957 2.2113 1.6438 1.9713 2.2004 1.4588 1.1051 1.7537 2.0015 2.3059 1.5766 1.6062 2.1641 2.5926 2.2100 2.1153 1.7540 1.4130 1.5303 1.2095 1.2141 1.3866 1.2637 1.3278 1.2847 1.3221 1.4241 1.6037 1.4714 1.2035 1.0795 1.0939 1.0751 1.0826 1.0439 1.0947 1.0626 12.4062 6.5747 1.0802 1.0616 1.0596 1.0355 1.0653 1.0669 1.0634 1.0972 1.0992 1.0944 1.0954 1.0906 1.0977 1.0972 1.1007 1.1023
irintensity: 0.8174 0.6562 1.7141 2.4752 1.0429 3.7367 1.6285 0.4060 1.4728 1.0962 0.2631 1.1473 4.3458 5.1115 2.7648 6.3799 1.2487 0.8306 8.0395 3.6032 15.5095 1.7713 6.8930 0.2479 13.4018 14.2610 47.5317 2.7630 11.1950 3.8324 8.2455 2.7196 0.7735 6.0150 44.5314 50.8580 0.8430 3.4070 4.9290 0.1470 5.5298 6.5894 7.7880 2.3152 1.1328 0.6381 1.4886 5.5564 2.7023 10.0188 20.3241 12.6254 8.0876 8.2511 14.5712 3.9635 11.0196 178.5525 0.0524 9.3702 42.0527 17.1731 38.0484 13.3552 25.1881 40.0041 10.7620 9.6141 3.8026 19.5033 12.8867 22.6608 93.9130 47.1513 65.0871
temp: 298.150 k
press: 1.00000 atm
elementType: 8 6 6 6 6 6 6 6 6 6 6 1 1 1 1 1 1 1 1 1 1 1 1 1 1 1 1
symmnumber: 1
zpe: 616183.0 jmol-1
zpe.correction: 0.234692 hartree
zpe.thermalcorrener: 0.246931 hartree
zpe.thermalcorrenthalpy: 0.247875 hartree
zpe.thermalcorrgfe: 0.194806 hartree
zpe.sumelectzpe: -465.000049 hartree
zpe.sumelectthermal: -464.987810 hartree
zpe.sumelectthermalent: -464.986866 hartree
zpe.sumelectthermalfe: -465.039934 hartree
dipole: -1.3208 3.0402 -0.1993
dipole: 3.3207
quadrupole: -69.8984 -74.8062 -64.3486
quadrupole: 9.3768 -0.2933 0.7310
quadrupole: -0.2140 -5.1218 5.3358 9.3768 -0.2933 0.7310
hfenergy: -465.2347405 hartree
pointgroup: C01 [X(C10H16O1)]
dipole: 0.5034738 1.1984563 0.1305644 debye
polarizability: 142.4325147|5.7474883|100.0891905|-2.1346391|-0.9153361|85.2683276 unknown
InChI: InChI=1S/C10H16O/c1-2-3-4-6-9-7-5-8-10(9)11/h3-4,9H,2,5-8H2,1H3
charge 0 multiplicity 1
27 atoms
O  -2.824452 -1.755542 -0.174954
C  -0.981876 -0.169583 0.353055
C  -0.908773 1.33913 0.006797
C  -2.36245 1.853119 0.22278
C  -3.251338 0.692471 -0.289687
C  -2.415678 -0.575446 -0.051137
C  0.102912 -1.087569 -0.265452
C  1.478388 -0.846017 0.318285
C  2.579373 -0.479022 -0.388572
C  3.958265 -0.244681 0.194264
C  4.484534 1.188442 -0.078869
H  -0.940737 -0.280686 1.461024
H  -0.616129 1.45964 -1.055445
H  -0.166773 1.881396 0.615929
H  -2.556979 2.804566 -0.300831
H  -2.546196 2.023001 1.300933
H  -3.429668 0.775967 -1.381265
H  -4.242199 0.610771 0.189607
H  0.125645 -0.938888 -1.362819
H  -0.213249 -2.136506 -0.090921
H  1.572267 -0.992351 1.407659
H  2.484757 -0.329087 -1.477152
H  3.939995 -0.436042 1.28457
H  4.672949 -0.972671 -0.243305
H  3.824766 1.944328 0.384195
H  5.503654 1.322205 0.328535
H  4.524191 1.395354 -1.164822
