program: Gaussian 09
title: 000103548
version: EM64L-G09RevD.01
frameworkgroup: C1[X(C18H18N2O7S)]
method: RPBEPBE
basis: SDD
operation: Freq
keyword: #p
keyword: freq=noraman
keyword: PBEPBE/SDD
title: #p freq=noraman PBEPBE/SDD
converged: YES YES NO NO
title: Mulliken charges:
elementType: S O O O O O O O N N C C C C C C C C C C C C C C C C C C H H H H H H H H H H H H H H H H H H
charge: 0.239056 -0.140536 -0.257818 -0.423661 -0.284562 -0.198597 -0.458618 -0.237109 -0.187991 -0.361813 -0.473026 -0.181512 0.107926 0.201824 0.365543 -0.785598 -0.488838 0.175511 0.128234 -0.301522 0.461036 -0.464827 -0.370541 0.294727 -0.218851 -0.211918 -0.232428 -0.744500 0.318789 0.314438 0.291388 0.272001 0.354856 0.304406 0.237965 0.236022 0.393917 0.370349 0.244738 0.266755 0.231141 0.230542 0.232902 0.250442 0.246467 0.253292
chargesum: 0.00000
title: Mulliken charges with hydrogens summed into heavy atoms:
elementType: S O O O O O O O N N C C C C C C C C C C C C C C C C C C
charge: 0.239056 -0.140536 -0.257818 -0.029744 -0.284562 -0.198597 -0.088269 -0.237109 -0.187991 -0.006957 -0.154237 0.132926 0.107926 0.201824 0.365543 -0.222209 0.053533 0.175511 0.128234 -0.065500 0.461036 -0.220089 -0.103787 0.294727 0.012290 0.018624 0.000474 0.005701
polarizability: 2.95306133e+02 -1.25800622e+01 2.58834450e+02 -3.19435568e+01 7.92820499e+00 1.91526819e+02
1716.lowfreq: -10.4907 -4.1549 -2.5111 0.0006 0.0008 0.0009 6.4456 15.1893 19.9475
frequency: 5.1416 15.1694 19.8192 23.3283 27.3817 31.0074 42.0607 49.1579 58.1299 62.1507 74.3079 82.3996 99.2605 117.5148 137.5786 152.4641 170.0088 197.5532 206.3197 217.7739 224.1505 257.9889 279.7736 293.2559 324.8633 332.9472 359.5646 366.4426 384.6530 402.5582 408.2593 430.0647 433.0786 472.1473 482.4662 514.5981 532.7783 535.6389 551.3858 559.6693 587.3464 612.5549 613.6357 626.3934 627.3479 637.2814 642.4691 683.6778 704.6512 719.9682 731.3081 735.3202 751.0852 771.0313 785.4963 796.0342 836.4796 856.0687 857.6329 875.5035 896.6274 920.7234 934.5349 946.4110 978.9295 985.0891 989.3547 992.8718 1000.0446 1000.8791 1017.6617 1021.3754 1029.7906 1042.4080 1084.5196 1089.6102 1093.8527 1124.6841 1159.4897 1173.2493 1179.4149 1182.0315 1186.4034 1189.3366 1196.5677 1201.5950 1209.3790 1238.3812 1245.2981 1251.7662 1268.1465 1283.9027 1308.4763 1321.6416 1330.5823 1339.2455 1371.9079 1384.6230 1387.3587 1388.1413 1423.9606 1440.7609 1452.2289 1454.7723 1465.9189 1482.0882 1492.6832 1594.3744 1607.4518 1614.0252 1621.7251 1648.6276 1655.1981 1737.3155 2921.4514 3009.2555 3012.0273 3044.3945 3047.4014 3068.3559 3074.7688 3097.0707 3105.9906 3132.1774 3144.0979 3144.5595 3144.8233 3159.2617 3170.6521 3400.2817 3496.3291 3515.1412
redmass: 5.9902 5.5990 4.4858 5.7551 1.3471 3.1873 10.0643 7.4534 7.3641 4.4274 7.8711 8.4306 3.2492 10.3347 7.3498 6.0852 6.4373 5.8024 6.6377 6.6353 6.4718 6.7886 6.2561 6.9616 4.9322 4.3403 3.4293 5.7065 5.5121 2.8246 4.1085 4.5094 4.3500 1.9398 2.2959 4.4183 3.0496 5.2123 3.0238 3.6602 3.3534 4.7072 5.3348 3.6329 2.4152 2.6229 1.4437 6.6573 1.9399 6.5345 5.6778 4.2665 2.7077 4.1055 3.7934 6.1065 4.0152 1.9698 1.3323 4.2236 5.9497 2.3673 2.2807 4.7125 1.3863 2.5076 6.0889 3.6678 1.6991 2.4027 3.1110 3.2501 2.6734 1.6624 1.6710 3.4909 1.9177 2.3259 1.2531 1.1064 1.3211 1.6134 1.8288 1.8022 1.6793 1.4624 1.5367 1.6627 1.5172 1.3569 1.8963 1.2900 2.4055 1.5553 1.2932 1.3795 1.7044 1.2653 4.2162 5.0204 1.0934 2.1447 1.0618 1.0483 1.1025 2.3337 1.8970 6.1175 6.9390 6.5079 8.2161 9.1363 9.1144 12.7996 1.0815 1.0368 1.0596 1.0844 1.0624 1.0890 1.1013 1.0973 1.0886 1.0863 1.1029 1.0916 1.1010 1.0956 1.1004 1.0642 1.0781 1.0640
irintensity: 1.0715 0.1641 0.9345 0.7687 0.8876 0.5781 0.4941 2.1236 0.8959 0.2998 1.3292 2.8058 3.2499 3.2234 2.6034 1.7008 0.6324 8.8567 6.3695 2.7767 3.6186 0.4295 4.7716 19.0839 24.8859 17.8562 3.9418 12.3309 6.0176 0.4432 20.5230 1.2325 8.5438 28.9206 69.2937 2.9667 45.8293 38.1036 16.5524 2.8281 17.5938 10.0465 10.7618 40.3532 9.7140 93.6677 21.2477 13.1610 55.2060 7.5171 14.6685 23.9323 38.2793 14.2011 22.9368 13.2143 3.3679 3.1871 0.9249 4.6808 111.5985 12.5855 15.2651 152.1581 0.6588 78.8219 0.3825 14.0555 10.3963 6.6876 62.7461 90.5770 61.2570 5.4027 34.9193 122.2612 99.2910 78.1657 9.4559 12.8363 68.2380 66.1068 220.9551 68.1415 17.7275 20.4561 5.8610 72.7886 22.6553 20.5468 1.9079 20.4547 163.1322 50.1944 10.8156 8.9965 98.0175 35.8608 116.3754 16.0769 16.2448 11.9160 26.4686 20.0835 20.1957 15.5885 340.5920 0.8745 139.2473 65.2378 103.8647 45.3954 202.8614 478.4884 34.5557 1.9200 14.7920 22.3315 22.4971 15.3160 5.6728 7.0625 11.1241 0.4638 1.2381 19.6737 7.8875 18.7579 14.6946 61.1785 68.5128 50.8811
temp: 298.150 k
press: 1.00000 atm
elementType: 16 8 8 8 8 8 8 8 7 7 6 6 6 6 6 6 6 6 6 6 6 6 6 6 6 6 6 6 1 1 1 1 1 1 1 1 1 1 1 1 1 1 1 1 1 1
symmnumber: 1
zpe: 889492.7 jmol-1
zpe.correction: 0.338790 hartree
zpe.thermalcorrener: 0.366379 hartree
zpe.thermalcorrenthalpy: 0.367323 hartree
zpe.thermalcorrgfe: 0.273242 hartree
zpe.sumelectzpe: -1728.787340 hartree
zpe.sumelectthermal: -1728.759751 hartree
zpe.sumelectthermalent: -1728.758807 hartree
zpe.sumelectthermalfe: -1728.852888 hartree
dipole: -5.7433 -0.5662 3.3033
dipole: 6.6497
quadrupole: -162.1235 -178.0815 -161.8793
quadrupole: -17.7663 -5.4327 0.0906
quadrupole: 5.2379 -10.7200 5.4821 -17.7663 -5.4327 0.0906
hfenergy: -1729.1261302 hartree
pointgroup: C01 [X(C18H18N2O7S1)]
dipole: -2.2479285 0.8747453 -1.0129525 debye
polarizability: 296.2473147|-4.9328958|238.6517265|33.7672737|30.7975092|210.7683612 unknown
InChI: InChI=1S/C18H18N2O7S/c1-9(21)27-7-11-8-28-17-12(16(24)20(17)13(11)18(25)26)19-15(23)14(22)10-5-3-2-4-6-10/h2-6,12,14,17,19,22,25H,7-8H2,1H3
charge 0 multiplicity 1
46 atoms
S  -1.627785 -2.626967 -1.30717
O  0.370721 -0.486682 2.333993
O  -5.536019 0.267773 -0.981124
O  -3.705783 0.449322 2.704324
O  2.981318 -2.830252 -1.067515
O  -1.879867 1.719026 2.031534
O  5.352024 -1.755423 -1.656269
O  -4.979492 2.286354 0.055939
N  -1.137148 -0.493725 0.403558
N  1.956679 -0.788962 -0.590137
C  -0.614808 -1.102154 -0.839281
C  0.737004 -1.384177 -0.088848
C  0.058118 -0.714158 1.158665
C  -2.485234 -0.240844 0.725751
C  -3.50278 -0.777614 -0.032975
C  -3.268716 -1.670197 -1.243574
C  -4.963261 -0.465287 0.208813
C  3.006203 -1.560968 -1.041034
C  -2.638168 0.744847 1.853086
C  4.257729 -0.804723 -1.585996
C  4.635776 0.408914 -0.746178
C  4.174313 1.699397 -1.107924
C  5.421914 0.251749 0.421149
C  -5.474891 1.671881 -0.913636
C  4.475254 2.819765 -0.298293
C  5.725979 1.370648 1.225515
C  5.247867 2.655934 0.873483
C  -6.093174 2.282379 -2.151488
H  -0.567028 -0.406781 -1.691522
H  0.914354 -2.46389 0.064258
H  -3.354445 -1.082306 -2.17524
H  -4.047156 -2.451904 -1.283594
H  2.111201 0.218254 -0.479601
H  -5.124337 0.131486 1.115717
H  -5.564747 -1.388867 0.240859
H  3.983431 -0.465164 -2.610939
H  -3.767886 1.163242 3.395897
H  4.940406 -2.666728 -1.605151
H  3.607697 1.838026 -2.038712
H  5.806182 -0.742556 0.669327
H  4.118001 3.814373 -0.586995
H  6.336349 1.243516 2.12643
H  5.48378 3.521978 1.501514
H  -6.014017 3.377636 -2.102469
H  -5.584792 1.909622 -3.057262
H  -7.154563 1.989205 -2.228086
