program: Gaussian 09
title: 000103503
version: EM64L-G09RevD.01
frameworkgroup: C1[X(C12H22O3)]
method: RPBEPBE
basis: SDD
operation: Freq
keyword: #pfreq=noraman
keyword: PBEPBE/SDD
title: #p freq=noraman PBEPBE/SDD
converged: YES YES NO NO
title: Mulliken charges:
elementType: O O O C C C C C C C C C C C C H H H H H H H H H H H H H H H H H H H H H H
charge: -0.458208 -0.272224 -0.227902 0.320506 -0.472449 -0.497395 -0.180933 -0.412115 -0.387333 -0.389763 -0.450315 0.196061 -0.705623 -0.225112 -0.675090 0.227037 0.213801 0.198453 0.201861 0.225380 0.226468 0.189679 0.190929 0.211715 0.184179 0.204264 0.215543 0.227566 0.333005 0.236475 0.218055 0.208891 0.227917 0.227556 0.211392 0.229142 0.228589
chargesum: 0.00000
title: Mulliken charges with hydrogens summed into heavy atoms:
elementType: O O O C C C C C C C C C C C C
charge: -0.125204 -0.272224 -0.227902 0.320506 -0.031611 -0.097082 0.044448 0.004031 0.015312 -0.001321 -0.007206 0.196061 -0.042202 0.230360 -0.005967
polarizability: 1.53142531e+02 -2.04785953e+00 1.42137812e+02 1.57742920e+00 1.78191821e+00 1.16377913e+02
1716.lowfreq: -10.0858 -8.0530 -0.0005 -0.0004 -0.0004 9.5652 20.4423 36.3537 72.4857
frequency: 17.7441 36.2351 72.4324 80.9070 85.9007 95.8268 136.8438 167.2278 186.6509 196.0724 225.6782 242.5084 255.3373 259.9802 280.7767 289.6773 313.8186 323.0608 353.8234 397.3282 399.9815 444.0957 477.9832 486.4720 601.0295 659.0018 685.9974 771.2569 781.6712 786.8727 799.6473 825.2323 830.1489 843.0971 872.9072 907.5613 922.0224 934.1955 942.4298 958.8570 1022.1382 1036.8998 1047.4289 1057.5628 1065.6373 1092.4985 1092.9823 1102.3208 1113.7738 1123.4660 1134.2093 1137.8940 1153.9935 1170.5740 1236.1937 1246.8873 1249.8755 1261.0862 1269.1637 1295.8330 1310.8471 1324.8271 1332.5023 1336.9138 1341.8099 1347.2339 1351.3894 1358.6825 1375.0257 1392.8756 1399.9069 1443.5152 1454.4008 1456.8531 1463.4227 1463.6902 1466.8370 1474.4224 1475.1475 1478.3000 1485.2922 1487.1507 1633.5864 2958.5093 2967.3933 2979.3277 2983.6489 2984.4244 2985.3227 2992.3064 2994.3619 3007.8891 3017.1606 3026.1247 3028.2790 3043.5063 3044.5011 3047.5500 3060.3423 3065.3288 3076.4801 3082.5296 3090.8043 3105.4922 3557.5441
redmass: 3.2481 3.4055 2.5162 2.4171 3.9011 2.8407 3.3703 2.3196 2.2921 1.9749 1.7596 2.3376 1.1545 1.7606 2.2656 2.8630 3.0157 3.3263 2.8231 2.7180 2.0676 3.0201 3.2967 1.9196 3.9304 2.9046 3.7581 1.6420 2.2310 2.7881 1.1352 2.7894 2.7892 1.6844 2.3003 2.6856 1.5085 1.9712 2.2032 2.3062 2.3321 2.9070 2.0412 1.8108 1.7667 1.8287 2.3679 1.5577 2.2194 1.7663 1.4906 2.4768 2.3785 1.3650 1.2836 1.1422 1.3437 1.3193 1.2307 1.3648 1.3449 1.3990 1.3854 1.5157 1.4606 1.4484 1.4320 1.4923 1.4916 1.2054 1.2656 1.0900 1.0930 1.0871 1.0783 1.0442 1.0814 1.0617 1.0905 1.0504 1.0472 1.0693 9.4813 1.0635 1.0593 1.0357 1.0619 1.0601 1.0607 1.0632 1.0358 1.0583 1.0861 1.0964 1.0953 1.1012 1.0992 1.1021 1.1021 1.1065 1.1000 1.1005 1.0985 1.1024 1.0656
irintensity: 1.5088 0.9559 1.1983 1.0040 0.6742 0.7364 3.9921 1.2665 2.9682 6.7307 2.4459 1.1352 150.7646 4.3201 4.6960 7.5536 1.9669 4.8613 1.9768 2.8273 1.4732 2.9674 9.4422 4.0562 5.3131 1.1576 0.8479 0.2511 7.1619 9.6975 3.6647 4.5809 8.4946 8.1185 5.5520 27.2432 8.6813 18.3668 9.3312 30.3379 62.5024 13.9723 6.3413 8.9682 24.7090 57.3747 121.1250 5.0598 11.9932 86.9292 10.5577 33.1039 41.6146 12.1187 6.5241 0.2305 12.5700 29.8464 6.7135 12.0094 8.1706 37.4800 0.7631 5.7650 4.3079 2.5483 2.5820 4.7350 15.3893 11.5648 22.6158 9.8285 3.1794 10.8465 0.9219 12.3765 19.0694 3.6366 5.2276 11.5441 11.5079 13.9417 145.7314 39.4497 30.4978 32.8825 37.7746 28.0361 33.7839 35.4551 22.5605 18.6016 6.7877 54.2324 58.8805 24.7517 9.1172 25.4460 67.9510 8.2619 44.7468 48.5648 31.6187 44.1836 2.6073
temp: 298.150 k
press: 1.00000 atm
elementType: 8 8 8 6 6 6 6 6 6 6 6 6 6 6 6 1 1 1 1 1 1 1 1 1 1 1 1 1 1 1 1 1 1 1 1 1 1
symmnumber: 1
zpe: 847028.9 jmol-1
zpe.correction: 0.322616 hartree
zpe.thermalcorrener: 0.339928 hartree
zpe.thermalcorrenthalpy: 0.340872 hartree
zpe.thermalcorrgfe: 0.276902 hartree
zpe.sumelectzpe: -694.932879 hartree
zpe.sumelectthermal: -694.915568 hartree
zpe.sumelectthermalent: -694.914624 hartree
zpe.sumelectthermalfe: -694.978593 hartree
dipole: 0.2036 0.0124 -2.6432
dipole: 2.6511
quadrupole: -87.4135 -85.1495 -99.3792
quadrupole: -6.8503 -1.3252 -1.2391
quadrupole: 3.2339 5.4979 -8.7318 -6.8503 -1.3252 -1.2391
hfenergy: -695.2554954 hartree
pointgroup: C01 [X(C12H22O3)]
dipole: 0.0879397 -0.0920408 1.0352079 debye
polarizability: 153.121616|2.1960295|141.6567941|-1.6739381|3.8923815|116.8798451 unknown
InChI: InChI=1S/C12H22O3/c1-3-10(11(13)15-4-2)12(14)8-6-5-7-9-12/h10,14H,3-9H2,1-2H3
charge 0 multiplicity 1
37 atoms
O  -1.368055 -0.52529 -1.560311
O  2.120324 0.585582 0.452934
O  1.949887 -0.564379 -1.564706
C  -1.038482 -0.28596 -0.137858
C  -0.917073 1.252674 -0.02116
C  -2.191093 -0.807429 0.77144
C  0.317579 -1.008954 0.251856
C  -2.260036 1.976766 -0.268569
C  -3.527575 -0.076914 0.503894
C  -3.371263 1.451304 0.667881
C  0.336288 -2.522582 -0.096245
C  1.517718 -0.338307 -0.411111
C  1.53108 -3.267173 0.539953
C  3.2860 1.339664 -0.104917
C  3.762232 2.287861 0.990835
H  -0.168486 1.602888 -0.755374
H  -0.52817 1.499418 0.986093
H  -1.898073 -0.660087 1.831288
H  -2.329072 -1.896667 0.624652
H  0.435248 -0.879982 1.344499
H  -2.562432 1.813093 -1.320149
H  -2.119532 3.066555 -0.130909
H  -4.304616 -0.46737 1.189588
H  -3.857946 -0.297464 -0.529712
H  -3.112806 1.685993 1.722341
H  -4.329895 1.960432 0.450188
H  -0.603786 -2.994648 0.245724
H  0.396743 -2.634825 -1.196736
H  -1.363251 -1.500716 -1.734137
H  2.491557 -2.859759 0.176168
H  1.506613 -4.341893 0.284349
H  1.515884 -3.179011 1.642565
H  4.060605 0.609858 -0.403134
H  2.952111 1.872981 -1.013569
H  4.627552 2.873761 0.630518
H  2.961776 2.991212 1.27774
H  4.072046 1.727968 1.889892
