program: Gaussian 09
title: 000103500
version: EM64L-G09RevD.01
frameworkgroup: C1[X(C6H9NS2)]
method: RPBEPBE
basis: SDD
operation: Freq
keyword: #pfreq=noraman
keyword: PBEPBE/SDD
title: #p freq=noraman PBEPBE/SDD
converged: NO NO NO NO
title: Mulliken charges:
elementType: S S N C C C C C C H H H H H H H H H
charge: 0.189646 0.093870 0.255793 -0.457360 -0.382843 -0.029709 -0.511948 -0.834992 -0.514888 0.228368 0.217715 0.240553 0.237896 0.239335 0.240172 0.278048 0.256635 0.253707
chargesum: 0.00000
title: Mulliken charges with hydrogens summed into heavy atoms:
elementType: S S N C C C C C C
charge: 0.189646 0.093870 0.255793 -0.011277 0.095606 0.209627 -0.271776 -0.046601 -0.514888
polarizability: 1.02882328e+02 -2.95746827e+00 1.46700754e+02 -3.85787930e+00 -6.56843283e+00 6.30929726e+01
1716.lowfreq: -15.4550 -6.0144 0.0006 0.0009 0.0014 6.8174 7.8970 26.7678 38.8376
frequency: -15.0150 26.7322 38.7333 65.8199 106.0477 125.4287 158.3157 174.6518 284.4822 340.3198 367.4094 391.5935 394.1657 477.0626 608.8512 655.6726 751.4557 783.0229 862.8803 913.4996 941.1690 967.3762 990.1857 1002.9693 1089.1933 1120.0508 1189.1159 1237.1050 1259.4898 1282.3639 1321.5794 1344.2679 1348.3943 1448.8874 1457.1064 1459.6255 1466.0469 1636.2783 2216.8407 2968.8158 2984.8995 3010.7065 3020.4431 3057.1257 3101.2087 3111.7699 3128.4129 3142.8232
redmass: 9.6210 4.7523 3.9991 4.2286 2.1997 1.2044 3.1505 2.4566 4.6759 2.5564 4.9210 11.9499 11.0040 2.7815 4.3041 7.0976 2.5175 2.4817 2.0850 1.9699 1.1346 1.1769 1.2779 2.3621 2.7820 4.0710 1.2573 1.1601 1.1842 1.2070 1.2351 1.2917 1.1514 1.0527 1.0953 1.0541 1.0788 6.3858 12.2236 1.0574 1.0625 1.0289 1.1037 1.0993 1.0938 1.0904 1.1046 1.1044
irintensity: 0.6152 1.0015 5.7490 0.7959 5.5308 1.4433 0.1180 1.0603 0.8482 1.7942 8.2665 0.2466 1.7231 9.3629 17.1278 1.5664 13.3362 4.4906 6.9812 13.6993 56.1890 13.9880 11.4131 14.7487 2.5362 2.0586 0.5659 0.3639 13.6150 3.9132 12.7221 28.5243 3.0216 17.0354 17.5967 14.5416 26.9853 33.8233 789.2305 37.5380 61.9311 26.9852 25.2158 21.0140 10.9258 22.1164 16.3813 9.7171
temp: 298.150 k
press: 1.00000 atm
elementType: 16 16 7 6 6 6 6 6 6 1 1 1 1 1 1 1 1 1
symmnumber: 1
zpe: 357865.2 jmol-1
zpe.correction: 0.136304 hartree
zpe.thermalcorrener: 0.147253 hartree
zpe.thermalcorrenthalpy: 0.148197 hartree
zpe.thermalcorrgfe: 0.096719 hartree
zpe.sumelectzpe: -1084.185328 hartree
zpe.sumelectthermal: -1084.174379 hartree
zpe.sumelectthermalent: -1084.173435 hartree
zpe.sumelectthermalfe: -1084.224913 hartree
dipole: 0.6899 2.9065 0.8474
dipole: 3.1051
quadrupole: -79.1827 -60.8851 -68.0304
quadrupole: -13.6744 1.5236 -2.0398
quadrupole: -9.8166 8.4810 1.3356 -13.6744 1.5236 -2.0398
hfenergy: -1084.3216317 hartree
pointgroup: C01 [X(C6H9N1S2)]
dipole: 0.0708404 1.2180793 0.0605784 debye
dipolederiv: -0.4364783 0.2623899 -0.0851467 0.1746827 -0.1150714 -0.0401473 0.058383 -0.1270386 -0.0559018 -0.1523859 -0.0819827 0.02402 -0.26034 -0.9007513 0.2096924 0.078566 0.2304101 -0.1833965 -0.337185 -0.2402807 0.0451313 -0.4908674 -1.893431 0.4569682 0.0842002 0.4432364 -0.2937397 0.1339075 0.0218835 -0.0043142 0.0052726 0.0758545 -0.0206378 -0.1015827 0.1252076 0.0783615 0.2847726 0.0894231 -0.0308241 0.2465741 0.928393 -0.171311 0.0119773 -0.2168643 0.3660453 -0.2502853 -0.0007062 -0.0500821 0.0424605 -0.3155177 -0.0338084 -0.1433048 -0.1076987 0.0966284 0.5042633 -0.4386872 -0.091668 -0.4774678 -0.0096943 0.038954 -0.1444447 0.1051383 0.0467261 0.0311479 -0.0732225 0.0901416 0.0025439 0.1626263 -0.0537079 0.1311813 -0.069119 0.069504 0.0683229 0.2344767 -0.0702002 0.5719799 2.0936449 -0.5930632 -0.1591724 -0.5963702 0.1388617 0.0270063 0.0090229 -0.0290841 0.0108461 0.1090022 0.0528063 0.0119725 -0.0304376 -0.1305914 -0.0286297 0.0197229 0.0148509 0.0621033 -0.2017956 0.0419605 0.027581 0.0522144 0.0885857 -0.1249762 0.1118802 0.0471924 0.0139343 -0.1248023 0.0200901 0.0890748 -0.0404958 0.068841 0.1135541 -0.0503907 0.0087543 -0.0533965 -0.0637751 0.0239248 -0.0270559 0.0999931 -0.1308527 0.0755752 0.0553721 0.0392657 0.0671631 0.1378082 0.0300651 0.0537919 0.0267872 -0.0852545 -0.0044033 0.1122349 0.0717255 0.0269053 0.1408124 0.0301578 0.0751496 0.0236861 -0.0894833 0.0120535 -0.1224334 -0.0304036 -0.0518508 -0.0636384 0.0307689 -0.0529868 0.0645143 0.0618476 0.1234472 -0.0081696 0.0108974 -0.000956 0.0094136 -0.018093 -0.0447669 0.0205901 -0.1430287 -0.0397068 0.0994669 0.039744 0.1104129 0.0309219 -0.0046196 0.0514365 -0.0037533 0.0968473 unknown
polarizability: 104.9020443|-12.9992558|137.3015937|-3.6736392|-22.7230666|70.472416 unknown
InChI: InChI=1S/C6H9NS2/c1-9-5-3-2-4-7-6-8/h3,5H,2,4H2,1H3
charge 0 multiplicity 1
18 atoms
S  3.380839 -0.133538 -0.541201
S  -1.963217 -2.646324 0.917077
N  -1.67584 0.070468 0.137517
C  -0.174322 2.044733 0.219784
C  -1.532772 1.436813 -0.250278
C  1.019262 1.38741 -0.440561
C  1.895561 0.590985 0.224312
C  3.522255 -1.700198 0.500913
C  -1.797051 -1.081389 0.465975
H  -0.108989 1.958403 1.319714
H  -0.207667 3.125448 -0.025054
H  -2.367925 2.025127 0.179924
H  -1.610494 1.508929 -1.3535
H  1.15001 1.560426 -1.518549
H  1.77584 0.377202 1.295238
H  2.656038 -2.354374 0.323311
H  3.599042 -1.438186 1.568191
H  4.447331 -2.202035 0.178686
