program: Gaussian 09
title: 000103523
version: EM64L-G09RevD.01
frameworkgroup: C1[X(C18H30NOP)]
method: RPBEPBE
basis: SDD
operation: Freq
keyword: #p
keyword: freq=noraman
keyword: PBEPBE/SDD
title: #p freq=noraman PBEPBE/SDD
converged: YES YES NO NO
title: Mulliken charges:
elementType: P O N C C C C C C C C C C C C C C C C C C H H H H H H H H H H H H H H H H H H H H H H H H H H H H H H
charge: 1.049747 -0.685455 -0.072725 -0.644169 -0.422492 -0.356527 -0.367358 -0.349729 -0.646473 -0.639804 -0.391108 -0.399664 -0.398326 0.490749 -0.661061 -0.657016 -0.363734 -0.415852 -0.238059 -0.254625 -0.243186 0.281272 0.215285 0.224491 0.241736 0.177418 0.214138 0.167457 0.170138 0.200859 0.225415 0.261361 0.229917 0.278069 0.193185 0.203110 0.191791 0.204458 0.189592 0.214619 0.214972 0.261465 0.222644 0.219799 0.264765 0.210902 0.268526 0.241228 0.226992 0.223742 0.227519
chargesum: 0.00000
title: Mulliken charges with hydrogens summed into heavy atoms:
elementType: P O N C C C C C C C C C C C C C C C C C C
charge: 1.049747 -0.685455 -0.072725 -0.362897 0.017284 0.062628 0.014237 0.021268 -0.159697 -0.131818 0.005188 -0.003415 0.005885 0.490749 0.038020 0.038451 -0.095208 -0.174624 -0.011067 -0.030882 -0.015667
polarizability: 2.39427893e+02 -1.28363237e+01 2.52420975e+02 1.15945230e+01 7.55890809e+00 1.87591906e+02
1716.lowfreq: -14.7265 -2.5760 -0.0006 0.0004 0.0005 11.2237 16.0431 26.7519 28.6109
frequency: 11.3496 26.7262 27.9744 39.1253 42.1491 54.1109 58.1631 79.7241 87.4546 130.2304 134.8552 145.0201 173.7557 177.6522 193.4735 208.3559 221.9025 229.8394 239.0799 246.1090 266.6450 275.0674 303.0905 360.5052 374.4691 390.7901 404.1941 407.2038 443.5670 448.5147 483.4173 503.1487 551.7489 565.3183 589.0440 617.3748 646.5839 694.3626 702.5396 750.8652 752.7122 759.3602 767.0299 794.5807 802.3893 821.1849 849.5371 853.4140 857.6999 907.4364 919.6573 939.4898 957.6451 973.7791 980.2688 989.3872 989.9310 992.9260 996.4943 1011.0421 1018.6759 1024.0904 1032.5487 1035.0751 1047.0189 1053.1172 1058.2100 1060.9178 1079.8151 1102.5095 1110.3173 1122.8197 1150.0390 1156.2740 1167.9786 1173.0741 1176.5493 1197.7051 1204.7365 1233.7374 1236.8376 1243.6638 1258.9219 1261.6710 1262.5522 1265.7256 1286.7253 1300.8041 1302.5612 1315.5817 1329.6587 1340.7312 1342.3276 1344.8415 1350.1182 1371.6290 1382.6808 1392.7934 1393.2145 1394.6633 1435.5856 1439.7592 1440.4526 1450.4596 1459.0542 1459.9989 1463.2513 1470.7197 1473.4189 1475.9767 1477.9330 1482.8960 1483.9518 1485.3136 1490.5175 1588.9521 1611.2777 2813.9959 2823.4050 2841.3840 2967.7965 2980.5595 2984.5478 2985.1529 2985.6634 2987.5074 2998.6293 3002.7732 3008.2526 3022.1383 3030.4579 3033.1124 3036.4628 3045.7034 3055.0312 3056.4605 3062.4676 3064.7411 3078.2432 3082.1062 3090.1443 3094.1169 3119.3658 3129.5803 3140.8320 3151.4559 3165.0145
redmass: 3.4256 3.5686 2.8969 3.4283 3.4255 2.7722 3.5716 3.7121 3.4506 2.9224 2.7324 3.3853 1.6865 3.0912 1.3844 2.9746 2.5258 2.1152 2.2458 3.6254 1.9487 2.7396 2.0308 3.7295 2.2910 2.4660 2.8714 3.9477 3.2160 2.9824 3.4620 3.0305 2.1177 3.7405 3.2551 6.3460 3.8975 4.2803 1.5517 2.1432 1.3015 2.7017 1.2975 2.3370 1.5645 1.6654 1.2617 1.4265 2.7113 2.3249 1.4462 3.5850 1.3075 1.4205 1.3360 4.7210 2.2232 1.3601 1.6999 2.4458 1.6865 1.7795 2.2843 2.3892 2.2749 2.2485 2.1327 2.0126 1.5791 1.7574 2.0627 2.5567 1.2786 2.5103 1.2620 1.0976 1.2307 1.1762 1.8758 1.7383 1.2643 1.2174 1.2709 1.3236 1.3446 1.1766 1.3123 1.3183 1.4313 1.3338 1.2705 1.4256 1.3285 1.4326 1.4973 1.3527 6.9082 1.3830 1.1974 1.1827 1.0822 2.0813 1.1081 1.0905 1.0867 1.0850 1.0918 1.0898 1.0393 1.1312 1.0529 1.4491 1.0488 1.1878 1.1951 5.8864 5.9180 1.0716 1.0706 1.0701 1.0623 1.0359 1.0355 1.0613 1.0613 1.0813 1.0603 1.0588 1.0584 1.0878 1.0900 1.0881 1.0919 1.1033 1.1036 1.1003 1.1005 1.1012 1.1007 1.1005 1.1015 1.1012 1.0846 1.0873 1.0926 1.0957 1.1012
irintensity: 1.2774 0.5053 0.3962 0.1161 0.2615 1.4660 0.4373 1.7966 0.7244 4.6176 0.2802 3.4285 6.6129 1.2687 1.6291 4.8439 1.7523 6.5900 3.6300 1.5106 1.9764 4.8021 3.1602 8.8201 2.0490 5.7657 0.4440 2.1738 3.2054 1.8883 26.6233 5.9339 2.0297 2.9240 26.3366 0.4852 29.0344 14.3133 42.3819 11.1387 11.7162 33.4051 39.9026 35.6875 1.6805 0.8581 2.2191 3.9903 6.2823 3.4255 5.4365 51.4558 3.0811 0.3818 8.4924 0.3484 20.0916 0.2173 4.0464 1.5509 6.5035 3.1087 1.6443 14.1947 16.6462 23.0388 8.1205 8.2735 25.4633 27.1354 10.9606 5.1101 5.4745 34.6225 12.6041 1.0470 4.3943 1.2760 0.8657 6.0024 2.8631 3.3423 5.8288 10.5415 0.8409 5.4288 3.3795 9.0708 13.4735 1.6892 5.5786 0.6546 0.2160 10.8504 1.3919 6.1883 0.3661 1.3314 18.1673 15.2622 4.4707 9.4480 7.1535 6.9336 12.0102 9.9626 10.2302 0.8681 12.4486 8.7215 12.7684 33.6320 11.2241 2.6560 5.7125 1.5916 9.6483 50.1917 56.5106 173.9063 38.9479 30.0201 40.4775 30.8296 36.3354 5.1448 5.7178 9.1457 24.8713 46.0220 77.5902 24.7255 17.4757 19.6401 91.1681 48.3737 19.5707 3.9535 32.2188 30.3829 24.2225 21.5338 3.5086 2.2195 31.4643 24.2799 19.3431
temp: 298.150 k
press: 1.00000 atm
elementType: 15 8 7 6 6 6 6 6 6 6 6 6 6 6 6 6 6 6 6 6 6 1 1 1 1 1 1 1 1 1 1 1 1 1 1 1 1 1 1 1 1 1 1 1 1 1 1 1 1 1 1
symmnumber: 1
zpe: 1165348.2 jmol-1
zpe.correction: 0.443858 hartree
zpe.thermalcorrener: 0.467649 hartree
zpe.thermalcorrenthalpy: 0.468593 hartree
zpe.thermalcorrgfe: 0.387375 hartree
zpe.sumelectzpe: -1173.446288 hartree
zpe.sumelectthermal: -1173.422496 hartree
zpe.sumelectthermalent: -1173.421552 hartree
zpe.sumelectthermalfe: -1173.502770 hartree
dipole: 4.1697 -0.7277 1.5635
dipole: 4.5122
quadrupole: -151.5911 -127.4607 -135.2458
quadrupole: -4.8451 -8.1832 -0.8793
quadrupole: -13.4919 10.6385 2.8534 -4.8451 -8.1832 -0.8793
hfenergy: -1173.8901455 hartree
pointgroup: C01 [X(C18H30N1O1P1)]
dipole: -1.6804515 0.2091483 0.5327845 debye
polarizability: 242.1089982|-13.8636827|248.9466131|-7.8120919|-13.3950862|188.3851629 unknown
InChI: InChI=1S/C18H30NOP/c1-3-21(20,4-2)18(17-11-7-5-8-12-17)13-16-19-14-9-6-10-15-19/h5,7-8,11-12,18H,3-4,6,9-10,13-16H2,1-2H3
charge 0 multiplicity 1
51 atoms
P  2.17362 1.678961 -0.036236
O  3.577606 1.547644 -0.840256
N  -2.917041 -0.194207 -0.057006
C  0.906239 0.304167 -0.551971
C  -0.511014 0.563056 0.004928
C  -1.565304 -0.368258 -0.639871
C  -3.786503 -1.376171 -0.304201
C  -3.582504 1.058874 -0.500429
C  1.350055 3.355208 -0.377114
C  2.37268 1.551896 1.843292
C  -5.132504 -1.242656 0.436261
C  -4.924095 1.270762 0.230494
C  -5.857737 0.057481 0.022218
C  1.522593 -1.052606 -0.226793
C  1.099114 3.56271 -1.883927
C  3.594533 2.362665 2.322899
C  2.596783 -1.528315 -1.02681
C  1.103195 -1.83952 0.878865
C  3.219255 -2.762272 -0.741392
C  1.724732 -3.076575 1.163276
C  2.783943 -3.54523 0.352985
H  0.884648 0.41818 -1.655357
H  -0.793504 1.614695 -0.189513
H  -0.55108 0.425857 1.101768
H  -1.258654 -1.416955 -0.475563
H  -1.563394 -0.203801 -1.749991
H  -3.249349 -2.278508 0.043047
H  -3.986366 -1.508355 -1.401503
H  -3.768421 1.037479 -1.608728
H  -2.911409 1.913196 -0.298546
H  0.424462 3.444419 0.219631
H  2.066603 4.108046 0.000657
H  1.435479 1.891407 2.322327
H  2.502964 0.478076 2.06887
H  -5.760493 -2.127934 0.218613
H  -4.938509 -1.226846 1.526256
H  -5.400402 2.199004 -0.140027
H  -4.724063 1.40321 1.311359
H  -6.144596 -0.006107 -1.048135
H  -6.792774 0.182613 0.600207
H  0.328485 2.870767 -2.271718
H  2.03098 3.392424 -2.45205
H  0.755513 4.593513 -2.083809
H  3.791746 2.166284 3.392107
H  4.490215 2.07899 1.742845
H  3.442814 3.450837 2.200796
H  2.960504 -0.91036 -1.854584
H  0.282149 -1.498384 1.520035
H  4.049016 -3.108333 -1.367807
H  1.381176 -3.673114 2.016325
H  3.264915 -4.504917 0.573174
