program: Gaussian 09
title: 000009005
version: EM64L-G09RevD.01
frameworkgroup: C1[X(C4H10O3)]
method: RPBEPBE
basis: SDD
operation: Freq
keyword: #pfreq=noraman
keyword: PBEPBE/SDD
title: #p freq=noraman PBEPBE/SDD
converged: YES YES NO NO
title: Mulliken charges:
elementType: O O O C C C C H H H H H H H H H H
charge: -0.278983 -0.262345 -0.271536 0.074235 -0.504570 -0.516068 -0.494132 0.207171 0.232842 0.233312 0.204855 0.244555 0.222603 0.231487 0.230674 0.245849 0.200051
chargesum: 0.00000
title: Mulliken charges with hydrogens summed into heavy atoms:
elementType: O O O C C C C
charge: -0.278983 -0.262345 -0.271536 0.281407 0.166438 0.182577 0.182442
polarizability: 6.18084908e+01 -1.12128111e-01 5.84727636e+01 -3.35202412e-01 1.16477057e+00 4.62066878e+01
1716.lowfreq: -18.2116 -0.0005 -0.0004 0.0006 4.7071 14.4662 91.3410 101.1083 112.6841
frequency: 91.3378 101.0862 112.6087 138.1595 153.0871 166.0701 233.6201 271.8522 310.8994 460.0029 508.1788 625.6397 864.8912 876.0845 935.8382 995.3429 1050.3656 1067.9105 1111.8655 1114.8981 1117.6939 1141.1044 1155.9507 1168.0165 1292.8969 1324.3874 1419.4825 1429.2790 1432.4115 1454.5687 1455.1970 1456.3662 1477.3595 1479.7010 1483.4674 2935.8873 2950.7780 2956.8946 2991.4413 3043.5054 3065.1192 3094.4412 3115.1401 3122.5210 3126.1939
redmass: 2.5422 2.3560 1.7201 1.1430 1.3432 1.1946 3.3991 3.4981 3.4057 5.9136 4.9559 5.3973 5.6146 5.4767 4.9647 10.5739 5.2033 4.2809 1.2626 1.2664 1.3377 1.3426 1.4621 1.6859 1.1745 1.1569 1.1308 1.1452 1.1432 1.0547 1.0532 1.0512 1.0525 1.0528 1.0512 1.0824 1.0369 1.0392 1.0297 1.0988 1.0937 1.1035 1.1005 1.1032 1.1045
irintensity: 3.6129 7.0881 9.8774 2.8125 2.8473 6.0806 11.7881 1.4153 3.1406 12.1358 1.5720 1.0996 60.1854 139.4109 14.0936 198.3062 232.8109 166.6883 1.0678 3.7728 24.5034 8.6743 4.5033 8.0943 30.8690 16.0961 4.6078 11.5392 11.9830 1.4571 13.5073 7.5577 19.2225 12.9652 9.5900 54.0202 74.8204 89.4561 40.4835 51.1689 42.9827 34.3133 23.8469 25.4387 26.6770
temp: 298.150 k
press: 1.00000 atm
elementType: 8 8 8 6 6 6 6 1 1 1 1 1 1 1 1 1 1
symmnumber: 1
zpe: 370121.9 jmol-1
zpe.correction: 0.140972 hartree
zpe.thermalcorrener: 0.150380 hartree
zpe.thermalcorrenthalpy: 0.151325 hartree
zpe.thermalcorrgfe: 0.106760 hartree
zpe.sumelectzpe: -383.439748 hartree
zpe.sumelectthermal: -383.430340 hartree
zpe.sumelectthermalent: -383.429396 hartree
zpe.sumelectthermalfe: -383.473961 hartree
dipole: -0.1274 1.7059 -0.1029
dipole: 1.7137
quadrupole: -37.2587 -40.2632 -44.4718
quadrupole: -0.4867 -2.1798 3.7212
quadrupole: 3.4059 0.4014 -3.8072 -0.4867 -2.1798 3.7212
hfenergy: -383.5807204 hartree
pointgroup: C01[X(C4H10O3)]
dipole: 0.0015298 -0.6738766 -0.02157 debye
dipolederiv: -0.7903326 0.2911381 -0.0146921 0.3243916 -1.0656183 -0.0281039 -0.1130055 0.2896001 -0.4422942 -0.753521 -0.3648656 -0.1123744 -0.1956789 -0.9893763 -0.1417147 -0.130526 -0.124272 -0.5242853 -1.2893817 -0.1054371 0.0628893 0.0660968 -0.5381242 0.0030109 0.2295722 0.0910516 -0.4587769 1.6167837 0.2090434 0.0827087 -0.3219432 1.55441 0.046441 0.0117567 -0.4549806 0.7521941 0.4589122 -0.2304139 -0.0297738 -0.1203315 0.451356 0.0927284 -0.0782983 0.1718775 0.2840694 0.3183709 0.051767 0.0729845 0.0532673 0.4347287 0.1234128 0.1537478 0.2554797 0.3759188 0.6142029 0.108365 -0.0044827 0.277442 0.3114762 -0.0235477 0.013233 -0.0134778 0.3214507 -0.0563257 -0.0364742 -0.0444666 0.0260286 -0.085996 -0.1255711 -0.0358609 -0.0368541 -0.190583 0.0689767 0.052808 -0.0097315 0.0777698 -0.0509246 0.0944575 -0.0303198 0.1271253 0.0007801 -0.1421608 -0.0284082 0.0311812 -0.1181271 0.0118098 0.0096242 0.0601544 -0.0368136 0.0744457 0.0036153 0.0017548 -0.0848229 0.0212436 0.0024484 -0.0837511 -0.008431 -0.1831631 -0.1439848 -0.0178506 0.1431333 0.043274 0.0769422 -0.0248817 -0.066382 -0.0110402 -0.0859249 0.0381252 -0.0782406 -0.1462271 0.0180889 -0.1118793 0.0147318 -0.0106589 0.0464319 0.0063959 0.0778859 0.0862972 0.0262561 -0.0306338 0.0410603 -0.0050407 0.116765 -0.0689221 0.0272356 -0.0899266 -0.1054818 0.061093 0.0601004 0.1046598 0.0217128 -0.044777 0.0671818 -0.0362918 0.0951104 0.0563372 0.0083526 -0.0405005 -0.0796163 -0.0550162 0.1156345 -0.0049677 0.1135115 -0.0096936 0.0097987 -0.0418854 0.0002513 -0.1213258 0.0123043 -0.0775679 -0.1007064 -0.1104993 -0.1604359 unknown
polarizability: 61.7761697|0.3761791|58.1886587|0.0592144|2.2879649|46.5231138 unknown
InChI: InChI=1S/C4H10O3/c1-5-4(6-2)7-3/h4H,1-3H3
charge 0 multiplicity 1
17 atoms
O  0.338206 -1.08449 0.413535
O  0.937277 1.023499 -0.589737
O  -1.251987 0.579669 0.073192
C  -0.058794 0.011546 -0.476016
C  1.426959 -1.900295 -0.142931
C  1.204857 1.767126 0.662377
C  -2.380602 -0.359628 0.155912
H  -0.203096 -0.373667 -1.511673
H  1.620275 -2.689888 0.599267
H  2.339812 -1.295256 -0.29808
H  1.130491 -2.362633 -1.107595
H  0.359235 2.434585 0.8972
H  2.114524 2.351343 0.456818
H  1.373677 1.068773 1.501823
H  -3.238206 0.239661 0.497323
H  -2.164692 -1.169882 0.873115
H  -2.606137 -0.795664 -0.839632
