program: Gaussian 09
title: 000103497
version: EM64L-G09RevD.01
frameworkgroup: C1[X(C10H12O3)]
method: RPBEPBE
basis: SDD
operation: Freq
keyword: #pfreq=noraman
keyword: PBEPBE/SDD
title: #p freq=noraman PBEPBE/SDD
converged: YES YES NO NO
title: Mulliken charges:
elementType: O O O C C C C C C C C C C H H H H H H H H H H H H
charge: -0.326879 -0.432890 -0.252416 0.004928 -0.333862 -0.699233 0.219198 0.210684 -0.340082 -0.343791 -0.218717 -0.217036 -0.220985 0.255908 0.193306 0.214370 0.260589 0.219713 0.219964 0.271267 0.265226 0.235225 0.232725 0.234181 0.348606
chargesum: 0.00000
title: Mulliken charges with hydrogens summed into heavy atoms:
elementType: O O O C C C C C C C C C C
charge: -0.326879 -0.084284 -0.252416 0.260836 0.073814 0.001033 0.219198 0.210684 -0.068814 -0.078565 0.016507 0.015689 0.013196
polarizability: 1.65278720e+02 -7.78044281e+00 1.11800037e+02 4.76402594e+00 1.50616463e+01 7.39964002e+01
1716.lowfreq: -10.3504 -3.3975 -2.0178 -0.0009 -0.0008 -0.0008 35.6442 46.4077 80.7511
frequency: 35.5670 46.3953 80.7356 98.6163 127.7500 170.1189 191.0805 202.3801 246.3093 306.9192 377.4468 403.5737 406.8555 420.1578 443.9750 487.6845 498.6081 614.0194 659.4939 680.8040 702.4589 774.7935 796.3553 812.9814 864.9277 894.5741 920.0167 954.9477 990.3383 996.0286 999.6070 1009.5383 1018.9185 1044.0261 1051.6131 1086.9745 1114.7383 1140.8492 1174.5452 1180.8511 1196.6226 1240.4426 1293.4119 1314.4536 1321.9813 1339.6062 1382.0252 1389.8266 1392.0887 1437.9712 1456.9876 1466.2961 1477.4335 1480.1706 1584.4655 1611.0507 1622.5217 2962.4635 2992.2145 3044.1622 3078.5955 3089.4116 3107.5746 3131.3911 3143.6473 3155.8820 3167.4699 3177.5859 3548.5336
redmass: 3.9412 5.1263 6.5447 4.7298 2.8578 4.0596 1.1395 2.8886 4.0307 4.8866 3.4633 2.8346 3.8137 1.3075 3.1142 3.9585 3.5404 6.4443 6.7290 5.0564 1.5910 4.0276 2.2189 6.2109 1.2441 2.0170 1.3379 1.4181 6.1677 1.3942 3.6777 1.3306 3.0453 2.3273 2.6660 1.7047 2.1825 1.5998 1.0566 1.1445 1.3808 3.1357 1.4430 1.3238 1.2758 1.2909 1.3195 8.0396 1.2493 2.2401 1.0803 1.0613 2.2220 1.0599 6.7529 6.1040 10.4136 1.0683 1.0367 1.0857 1.0962 1.0980 1.1002 1.0855 1.0890 1.0937 1.0974 1.0985 1.0655
irintensity: 0.7571 1.4222 2.7713 0.1123 4.7792 0.4117 0.1707 1.5206 5.4085 8.1799 4.8747 0.4678 16.6011 129.6178 24.9079 0.3641 9.6233 0.6252 5.0700 12.5285 94.6944 9.1378 21.0977 21.9459 0.1782 10.4586 8.9531 3.2328 3.0621 1.0318 100.1491 0.7404 97.8505 142.4152 140.9577 19.5860 7.0345 36.7158 0.0521 46.8409 27.5143 310.1231 5.5282 2.4791 11.3671 13.8113 2.8476 3.0736 39.5690 15.7874 3.1009 15.1878 7.9517 11.2411 36.1523 11.1310 159.0368 54.6233 22.0603 7.0818 6.3013 54.0547 14.2769 0.1982 10.0704 14.2622 20.3989 9.4813 6.9096
temp: 298.150 k
press: 1.00000 atm
elementType: 8 8 8 6 6 6 6 6 6 6 6 6 6 1 1 1 1 1 1 1 1 1 1 1 1
symmnumber: 1
zpe: 524166.9 jmol-1
zpe.correction: 0.199645 hartree
zpe.thermalcorrener: 0.212431 hartree
zpe.thermalcorrenthalpy: 0.213375 hartree
zpe.thermalcorrgfe: 0.159419 hartree
zpe.sumelectzpe: -612.965263 hartree
zpe.sumelectthermal: -612.952476 hartree
zpe.sumelectthermalent: -612.951532 hartree
zpe.sumelectthermalfe: -613.005488 hartree
dipole: -1.7165 0.7597 2.2534
dipole: 2.9328
quadrupole: -64.5322 -79.8597 -80.4794
quadrupole: -6.3554 7.5647 3.2635
quadrupole: 10.4249 -4.9026 -5.5223 -6.3554 7.5647 3.2635
hfenergy: -613.1649073 hartree
pointgroup: C01 [X(C10H12O3)]
dipole: 0.6618993 0.2912941 -0.8991263 debye
dipolederiv: -1.8554061 0.1917331 -0.2042453 0.5069944 -0.5939961 0.0811111 -0.237629 0.0596423 -0.3650353 -0.2528427 -0.0098875 -0.1714801 0.0821381 -0.7406718 -0.1480735 -0.1177916 -0.1255434 -0.6183273 -0.7916095 -0.1876459 0.051011 -0.0239853 -0.8489841 0.2246814 -0.0227488 0.2236932 -0.4111034 1.0419959 0.0191216 0.1008093 0.1392175 0.1892177 0.0363503 -0.045973 0.0842675 0.2672112 0.2254782 0.0333016 0.0764428 0.008837 0.4190359 0.1287391 0.0881821 0.0654263 0.529245 -0.1270609 0.0484976 -0.015334 -0.0342679 -0.0864526 -0.116754 -0.0175562 -0.1174996 -0.0430006 -0.6025076 -0.1646387 0.0393681 -0.1686295 -0.1091564 0.0273092 0.0406647 0.0309896 -0.0268646 2.2091624 0.1438118 0.0481031 -0.3383087 1.0723739 -0.3890933 0.2473162 -0.3606244 0.3943303 0.0600663 0.1341649 -0.0513582 -0.1030353 0.0076149 -0.0634132 0.0520725 -0.0460239 -0.0813228 0.0875204 -0.0550855 0.04198 0.1406826 -0.0240442 -0.0365883 -0.035004 -0.0474413 -0.0942639 0.0172121 -0.1622223 0.0890526 -0.1679619 -0.1031199 -0.0379392 0.0928685 -0.0365585 -0.13029 -0.2376768 0.0457835 -0.0268496 0.0708271 0.0967743 -0.1157035 -0.0389558 -0.1174707 -0.0991132 0.1208869 0.0453466 -0.0043479 0.0356793 0.010619 -0.0666227 0.0011197 -0.0666479 -0.1034102 -0.0278324 0.0276303 -0.0379119 -0.0690345 0.038271 0.0464945 0.021061 0.0415923 -0.0627209 0.0853587 -0.0342643 0.0446934 0.0110934 -0.0266966 0.0521292 -0.0266346 0.0629435 -0.2049019 -0.1419623 -0.0511818 -0.0189467 -0.0421118 0.0566338 -0.0181511 0.0388472 -0.0111598 0.0679314 0.0726535 0.1187365 0.0196899 0.1048213 -0.0330989 -0.0325306 0.0176947 -0.0022669 0.0798226 -0.1635671 -0.0768125 0.0022215 -0.0796347 0.1054971 -0.0066009 -0.0039396 0.002516 0.0813215 0.1156114 -0.0295077 0.0284407 -0.0090189 0.0207004 0.124754 0.0003907 0.0511362 -0.0786547 0.1335283 -0.0351503 0.0154476 -0.0013075 0.0158619 0.0671346 0.0024346 0.0636575 0.1242984 0.0423169 0.0738356 -0.0446 0.0820272 0.0745875 0.042051 -0.0540139 0.0383165 0.1257776 -0.0550788 0.0738573 -0.0505053 0.0861576 0.044836 0.0611443 -0.0561616 0.0602972 0.126282 0.0700354 -0.0261337 0.0063667 -0.0486131 -0.0630189 0.1032732 0.0157224 0.1046411 0.1077982 -0.096136 -0.0723927 0.0170305 -0.0743322 0.079488 0.0324103 0.0182496 0.0322338 0.1429659 0.0698538 -0.0508973 0.0449218 -0.108234 0.3977282 0.0038879 0.0197844 0.0098834 0.2720249 unknown
polarizability: 164.9809141|8.947182|111.3935353|4.1910972|-15.9575619|74.7007086 unknown
InChI: InChI=1S/C10H12O3/c1-8(7-11)13-10(12)9-5-3-2-4-6-9/h2-6,8,11H,7H2,1H3
charge 0 multiplicity 1
25 atoms
O  -1.251131 0.055852 -0.170697
O  -3.134653 1.685405 1.193292
O  -0.486116 -1.966476 0.710307
C  -2.674737 -0.425773 -0.036535
C  -3.493057 0.869264 0.033762
C  -3.035248 -1.322652 -1.224827
C  1.121009 -0.249467 0.05439
C  -0.241851 -0.828091 0.240108
C  2.231465 -1.015373 0.496468
C  1.330091 1.020793 -0.543793
C  3.539782 -0.51274 0.346166
C  2.64164 1.518844 -0.693277
C  3.74723 0.755269 -0.24821
H  -2.739335 -0.98004 0.917449
H  -3.369019 1.435383 -0.914262
H  -4.56019 0.623204 0.16508
H  -2.403597 -2.225768 -1.234077
H  -4.090373 -1.643983 -1.14801
H  -2.904053 -0.783749 -2.180128
H  2.045365 -1.993703 0.951769
H  0.46868 1.599265 -0.889026
H  4.395252 -1.10412 0.689581
H  2.803697 2.498408 -1.155887
H  4.764488 1.145498 -0.365066
H  -2.154837 1.836853 1.159522
