program: Gaussian 09
title: 000103493
version: EM64L-G09RevD.01
frameworkgroup: C1[X(C6H8Br2O4)]
method: RPBEPBE
basis: SDD
operation: Freq
keyword: #p
keyword: freq=noraman
keyword: PBEPBE/SDD
title: #p freq=noraman PBEPBE/SDD
converged: YES YES NO NO
title: Mulliken charges:
elementType: Br Br O O O O C C C C C C H H H H H H H H
charge: 0.078905 0.079239 -0.280356 -0.280042 -0.179084 -0.179749 -0.570296 -0.570638 0.353053 0.353626 -0.489747 -0.489490 0.348124 0.348039 0.237649 0.247944 0.253665 0.237707 0.247587 0.253864
chargesum: 0.00000
title: Mulliken charges with hydrogens summed into heavy atoms:
elementType: Br Br O O O O C C C C C C
charge: 0.078905 0.079239 -0.280356 -0.280042 -0.179084 -0.179749 -0.222172 -0.222599 0.353053 0.353626 0.249510 0.249669
polarizability: 1.12253100e+02 -7.66224736e+00 9.94483994e+01 -1.06741955e-02 -9.86012073e-02 1.04841878e+02
1716.lowfreq: -2.8920 -0.0006 -0.0006 0.0005 7.1590 9.6226 31.9417 39.5986 40.4448
frequency: 31.8481 39.5036 40.3184 70.7603 88.4860 92.8351 96.4595 107.1526 156.9812 158.2011 167.4138 246.3386 249.2221 274.7862 334.4643 346.3852 436.3653 508.7930 635.1896 639.9155 654.7377 730.1420 771.9561 823.5524 846.3673 961.6001 975.1358 1042.0806 1106.5765 1113.8541 1113.9772 1131.7341 1148.7631 1149.4371 1152.8133 1205.7896 1244.4066 1262.8998 1422.2798 1422.5002 1452.8431 1453.0131 1463.0121 1463.3553 1672.2044 1675.9217 3010.3954 3010.6464 3050.4907 3056.6998 3116.4063 3116.6534 3156.7734 3157.0316
redmass: 6.2789 6.5196 6.6311 4.1395 1.5342 1.8516 1.5502 7.4043 4.6669 5.7539 4.8002 9.2082 7.0866 4.7498 6.2054 8.5822 8.0309 8.4524 5.1861 4.7877 6.5084 6.8191 5.1779 6.8382 7.9668 7.0824 6.5111 3.7319 3.8429 1.2620 1.2624 1.7541 1.4085 1.4317 1.7118 1.4504 1.2153 1.7490 1.1621 1.1625 1.0493 1.0493 1.0508 1.0508 11.0808 10.8605 1.0291 1.0291 1.0817 1.0832 1.1052 1.1052 1.1054 1.1054
irintensity: 0.8184 0.7249 0.8333 0.9173 0.1376 0.0796 0.0380 0.3872 4.2007 1.9054 5.0862 4.9602 5.4960 5.8677 17.7424 8.6562 12.0306 13.1093 23.0446 4.2655 8.9809 0.0002 45.5266 9.0429 34.2338 60.8830 44.5237 7.2041 328.0380 0.2365 0.4626 147.4545 4.4724 20.1943 44.8258 64.8356 63.4661 3.5839 17.4152 10.6866 15.9354 14.6595 11.4977 13.8220 92.3208 209.9311 38.4527 17.8003 15.1255 0.5495 19.0629 19.3513 11.3752 12.1639
temp: 298.150 k
press: 1.00000 atm
elementType: 35 35 8 8 8 8 6 6 6 6 6 6 1 1 1 1 1 1 1 1
symmnumber: 1
zpe: 358027.2 jmol-1
zpe.correction: 0.136365 hartree
zpe.thermalcorrener: 0.151181 hartree
zpe.thermalcorrenthalpy: 0.152125 hartree
zpe.thermalcorrgfe: 0.090439 hartree
zpe.sumelectzpe: -560.296108 hartree
zpe.sumelectthermal: -560.281293 hartree
zpe.sumelectthermalent: -560.280349 hartree
zpe.sumelectthermalfe: -560.342034 hartree
dipole: 0.0009 -0.0448 5.2378
dipole: 5.2380
quadrupole: -75.6874 -92.8540 -82.4780
quadrupole: -11.2313 -0.1444 -0.0528
quadrupole: 7.9857 -9.1809 1.1951 -11.2313 -0.1444 -0.0528
hfenergy: -560.4324733 hartree
pointgroup: C01 [X(C6H8Br2O4)]
dipole: -0.021394 -2.0516591 0.1923724 debye
dipolederiv: -0.0869144 0.0721323 0.0435717 0.0571572 -0.2187096 -0.2072886 0.0028028 -0.1611127 -0.1998618 -0.08868 -0.0636681 0.0599494 -0.0562804 -0.1522414 0.1985755 0.0158869 0.1524311 -0.2642938 -0.9206401 0.4103914 0.2179782 0.4187679 -0.9336661 -0.3884874 0.2438831 -0.4015339 -0.5314809 -0.9353841 -0.3601182 0.2970237 -0.3614408 -0.7510892 0.4275415 0.3254069 0.4414494 -0.6970431 -0.7443137 -0.1909732 -0.2282043 -0.0031767 -0.5744216 -0.2251428 0.0032644 -0.2005358 -0.4122993 -0.7420154 0.1453627 -0.2612786 0.0062502 -0.4860683 0.2424601 0.0035298 0.2169136 -0.5056693 -0.2380232 -0.0730078 0.0232701 -0.2520831 0.3736124 0.5500937 -0.0038084 0.3096727 0.2366115 -0.230535 0.0850035 0.0006625 0.2575598 0.2171775 -0.5447656 -0.0483083 -0.3046154 0.3914222 1.2648967 -0.191797 0.0482227 -0.1822669 1.0520205 0.4977632 -0.1622112 0.5356503 0.563598 1.2707616 0.1928342 0.0084019 0.1397612 0.8176231 -0.5491446 -0.2036013 -0.5868205 0.7914904 0.5711169 -0.2498232 -0.1311869 -0.1422288 0.3197536 0.0237862 -0.096142 0.0405242 0.276298 0.5783879 0.2157759 -0.1753522 0.1188362 0.3015662 -0.0263738 -0.1196925 -0.0423419 0.2877223 0.128787 0.0504475 -0.0114803 0.0377818 -0.0182171 -0.0404246 0.0252637 -0.0066656 0.0046127 0.1244561 -0.0538149 -0.0011505 -0.0360012 -0.0083188 0.0418788 0.0319471 0.007916 -0.0043626 0.0653094 -0.0009272 0.0012177 0.034909 -0.0451797 -0.1007287 0.0287534 -0.1071491 0.0566949 -0.0324816 0.0804462 -0.0160527 0.0156144 0.0945156 0.0012066 -0.0893026 0.0392339 -0.0616956 -0.007686 0.0410586 0.0583338 -0.0595911 -0.0208532 0.0993126 0.052564 0.0558773 0.0377117 0.0646636 -0.0010184 0.002153 -0.0301293 0.0020125 0.1118493 0.0367814 0.1183889 0.010507 -0.0328175 -0.0801289 0.0004734 -0.03288 0.0801732 -0.0318982 -0.0846233 -0.0696067 -0.048219 -0.0088881 -0.0281752 0.0634473 0.0694405 -0.0496895 -0.0802132 0.0376062 -0.0376756 0.0682567 unknown
polarizability: 111.2160494|-0.7998118|104.8104131|-8.3832543|-0.3754337|100.5169151 unknown
InChI: InChI=1S/C6H8Br2O4/c1-11-5(9)3(7)4(8)6(10)12-2/h3-4H,1-2H3
charge 0 multiplicity 1
20 atoms
Br -0.111412 1.799562 1.678726
Br 0.131953 1.472105 -1.978851
O  2.161165 -1.115097 -0.267279
O  -2.191866 -0.98941 0.468642
O  2.782839 0.781709 0.940429
O  -2.780079 0.63255 -1.101599
C  0.377072 0.146806 0.654634
C  -0.385428 0.034999 -0.679696
C  1.901785 0.036362 0.482747
C  -1.912099 -0.016534 -0.496085
C  3.596148 -1.39216 -0.538466
C  -3.632301 -1.191504 0.774761
H  0.030595 -0.682921 1.296013
H  -0.054918 -0.900972 -1.164493
H  3.595399 -2.322025 -1.123171
H  4.142634 -1.515382 0.411018
H  4.03466 -0.558674 -1.111348
H  -3.647165 -1.978861 1.540516
H  -4.170582 -1.505818 -0.134584
H  -4.067797 -0.253335 1.155884
