program: Gaussian 09
title: 000103501
version: EM64L-G09RevD.01
frameworkgroup: C1[X(C15H24)]
method: RPBEPBE
basis: SDD
operation: Freq
keyword: #p
keyword: freq=noraman
keyword: PBEPBE/SDD
title: #p freq=noraman PBEPBE/SDD
converged: YES YES NO NO
title: Mulliken charges:
elementType: C C C C C C C C C C C C C C C H H H H H H H H H H H H H H H H H H H H H H H H
charge: 0.245247 -0.020491 0.475718 -0.672278 -0.475198 -0.625419 -0.800269 0.372124 -0.437712 -0.566785 -0.453241 -0.789750 0.151224 -0.783786 -0.780719 0.195195 0.216645 0.207659 0.198066 0.203336 0.218609 0.220987 0.221710 0.221843 0.230997 0.209237 0.208356 0.208058 0.215202 0.209102 0.214082 0.222397 0.218622 0.215868 0.217792 0.227288 0.216868 0.217674 0.225744
chargesum: 0.00000
title: Mulliken charges with hydrogens summed into heavy atoms:
elementType: C C C C C C C C C C C C C C C
charge: 0.245247 0.174704 0.475718 -0.247974 -0.073796 -0.185822 -0.125719 0.372124 -0.020119 -0.143525 -0.244140 -0.134650 0.151224 -0.122838 -0.120434
polarizability: 2.08559101e+02 1.26030876e+01 1.54813494e+02 8.76100045e+00 2.11888110e+00 1.17777192e+02
1716.lowfreq: -0.0008 -0.0007 -0.0004 3.4808 11.5176 23.4190 51.9114 52.8432 73.8449
frequency: 51.8112 52.6546 73.8066 106.8895 115.9160 153.1053 177.1427 196.1690 206.1694 239.9026 271.0383 275.4250 294.0156 314.4792 341.1213 348.4262 389.2191 394.3109 413.8552 436.3696 443.3204 472.9533 497.4169 528.9415 560.9610 612.6379 650.5750 699.1367 735.6878 802.5724 810.0844 844.3136 848.9868 892.8882 894.6259 925.7098 941.1198 942.8258 950.6181 962.8827 967.2484 986.2359 1007.0807 1033.0411 1054.2185 1074.3481 1078.8241 1096.9209 1109.9984 1125.5641 1130.1994 1149.4864 1169.0562 1173.3320 1181.8829 1196.7142 1215.1512 1235.7918 1254.0039 1270.5419 1290.5463 1295.7717 1303.1047 1330.5308 1336.5338 1338.9510 1349.4216 1358.1089 1382.4505 1387.4444 1396.2192 1398.3027 1449.7487 1456.4893 1458.9894 1460.8575 1465.1778 1467.7990 1470.3594 1473.6820 1476.7893 1480.5325 1483.4176 1487.5199 1496.4409 1675.5441 1688.2414 2937.5333 2943.8253 2947.9674 2956.3653 2957.0919 2961.2331 2964.7221 2974.4594 2976.5619 2981.1828 2998.8083 3020.4017 3023.1344 3027.2351 3033.1672 3057.6331 3063.2414 3064.4144 3072.6010 3073.4561 3079.4968 3080.6807 3099.3422 3103.7047
redmass: 2.2159 1.4539 2.0387 2.5237 2.3628 1.1534 2.2258 2.9048 1.0349 1.4578 2.2212 2.1829 2.1875 2.1035 2.7121 2.4552 2.3225 2.3789 2.5367 2.6577 3.3683 2.6054 3.0419 2.8738 2.8389 2.9522 3.4576 2.6949 2.5469 2.2148 1.6020 1.5319 2.0303 2.0978 2.3766 1.9249 1.4967 1.4233 1.6705 1.6757 1.4579 2.0606 1.6919 1.8714 2.1749 1.6356 1.6372 1.7921 1.5642 2.1109 1.6373 2.7449 1.7194 2.6335 1.8231 1.8299 1.4512 1.3600 1.5418 2.2009 1.4540 1.3039 1.4394 1.5759 1.3822 1.9629 1.5334 1.5075 1.2195 1.2552 1.2108 1.2017 1.0841 1.0712 1.0701 1.0757 1.0910 1.0823 1.0594 1.0620 1.0505 1.0658 1.0759 1.0576 1.0550 7.6219 6.6789 1.0815 1.0643 1.0684 1.0452 1.0596 1.0436 1.0616 1.0445 1.0525 1.0387 1.0899 1.0968 1.0962 1.0982 1.1023 1.0927 1.0979 1.0940 1.0975 1.0987 1.0977 1.0911 1.0934 1.0932
irintensity: 0.4155 0.0384 0.0845 0.1285 0.0061 1.0544 0.2979 0.1780 0.0903 0.2327 1.3955 1.8391 0.4730 0.8277 1.1553 0.4561 3.9967 0.3048 0.4790 0.2628 0.9049 0.8859 0.0053 1.2245 0.6976 0.7695 4.6985 3.7372 4.6407 0.5183 7.7862 9.2764 2.8644 0.9262 7.2238 3.2899 4.2371 0.5100 1.7821 0.4150 1.0995 15.1118 11.4280 1.5155 7.5921 8.9147 1.6968 1.6194 13.5313 4.3439 0.3963 6.4400 10.9298 4.4527 8.9673 2.2866 7.1861 0.3415 9.6887 0.4478 0.4410 0.6772 1.4484 0.8589 0.8295 0.0519 3.2500 2.9661 12.7540 23.6470 21.0006 7.6501 1.0041 10.1923 5.0190 7.7096 3.7749 4.4451 2.0303 18.9710 21.2705 8.0578 8.4178 27.4149 0.2663 3.0448 0.4204 8.8653 49.8654 46.1066 11.2213 48.3224 88.4366 43.1632 10.5135 35.3846 42.9826 61.7700 0.0775 55.6802 49.5117 50.1215 34.0341 24.1563 64.1319 53.4827 21.4798 34.2849 46.1093 49.2407 21.2754
temp: 298.150 k
press: 1.00000 atm
elementType: 6 6 6 6 6 6 6 6 6 6 6 6 6 6 6 1 1 1 1 1 1 1 1 1 1 1 1 1 1 1 1 1 1 1 1 1 1 1 1
symmnumber: 1
zpe: 917756.8 jmol-1
zpe.correction: 0.349555 hartree
zpe.thermalcorrener: 0.365710 hartree
zpe.thermalcorrenthalpy: 0.366654 hartree
zpe.thermalcorrgfe: 0.307260 hartree
zpe.sumelectzpe: -584.793729 hartree
zpe.sumelectthermal: -584.777574 hartree
zpe.sumelectthermalent: -584.776630 hartree
zpe.sumelectthermalfe: -584.836024 hartree
dipole: 0.1180 0.1724 0.0271
dipole: 0.2107
quadrupole: -90.4140 -92.6423 -95.4665
quadrupole: 0.0034 1.6869 -0.0185
quadrupole: 2.4269 0.1986 -2.6255 0.0034 1.6869 -0.0185
hfenergy: -585.143284 hartree
pointgroup: C01 [X(C15H24)]
dipole: -0.0461492 -0.0675428 0.0133357 debye
polarizability: 208.3364777|12.4184202|154.6950719|-9.9071966|-3.4955708|118.1182375 unknown
InChI: InChI=1S/C15H24/c1-11(2)13-8-9-14-7-5-6-12(3)15(14,4)10-13/h7,12H,5-6,8-10H2,1-4H3
charge 0 multiplicity 1
39 atoms
C  0.696101 -0.338457 0.160991
C  1.958053 -1.08979 -0.405186
C  0.930211 1.186052 0.125381
C  -0.537991 -0.664361 -0.767171
C  3.268482 -0.502245 0.175186
C  -0.300028 2.061982 0.325375
C  0.366133 -0.784332 1.615708
C  -1.778562 0.162477 -0.452901
C  3.446092 0.971408 -0.243436
C  -1.48203 1.649688 -0.603253
C  2.15395 1.748227 -0.083524
C  1.925428 -2.623946 -0.216657
C  -2.988253 -0.356537 -0.065141
C  -3.265489 -1.84364 0.117328
C  -4.224305 0.484558 0.230166
H  1.970638 -0.885905 -1.499325
H  -0.739674 -1.747003 -0.716985
H  -0.228227 -0.444818 -1.812105
H  4.132177 -1.105197 -0.167883
H  3.248739 -0.575967 1.280941
H  -0.651774 1.989721 1.375509
H  -0.035507 3.122115 0.149556
H  0.095962 -1.855821 1.64749
H  1.225587 -0.621201 2.290672
H  -0.493243 -0.218853 2.015868
H  3.786579 1.026662 -1.300416
H  4.246886 1.451518 0.354853
H  -1.183535 1.8561 -1.652869
H  -2.354917 2.286805 -0.384289
H  2.226671 2.845684 -0.130763
H  2.756552 -3.090915 -0.77789
H  2.047409 -2.905047 0.845789
H  0.985699 -3.076533 -0.581697
H  -3.622715 -2.044979 1.147637
H  -4.075401 -2.174054 -0.564201
H  -2.390706 -2.486548 -0.063479
H  -5.070813 0.162168 -0.409208
H  -4.552548 0.338061 1.279322
H  -4.078434 1.564023 0.072009
