program: Gaussian 09
title: 000103499
version: EM64L-G09RevD.01
frameworkgroup: C1[X(C14H24O)]
method: RPBEPBE
basis: SDD
operation: Freq
keyword: #pfreq=noraman
keyword: PBEPBE/SDD
title: #p freq=noraman PBEPBE/SDD
converged: YES YES NO NO
title: Mulliken charges:
elementType: O C C C C C C C C C C C C C C H H H H H H H H H H H H H H H H H H H H H H H H
charge: -0.462203 0.236381 -0.433906 0.178863 -0.454084 -0.492581 0.207144 -0.755102 -0.776924 -0.503301 -0.813299 0.483640 -0.221246 -0.820598 -0.723750 0.196266 0.196423 0.203345 0.204335 0.213503 0.210701 0.220761 0.225457 0.208715 0.215301 0.218756 0.220905 0.219862 0.218042 0.255206 0.212454 0.206092 0.250349 0.234332 0.211493 0.230116 0.233220 0.208516 0.336814
chargesum: 0.00000
title: Mulliken charges with hydrogens summed into heavy atoms:
elementType: O C C C C C C C C C C C C C C
charge: -0.125389 0.236381 -0.041217 0.178863 -0.046404 -0.068377 0.207144 -0.100169 -0.121962 -0.283438 -0.127596 0.483640 -0.015154 -0.124424 -0.051897
polarizability: 1.89742092e+02 6.22199687e+00 1.57657780e+02 -4.14321117e+00 2.75172767e+00 1.22579527e+02
1716.lowfreq: -12.3651 -3.6264 -0.0009 -0.0008 0.0000 7.9103 27.2444 45.1259 57.6399
frequency: 26.8680 44.7770 57.6201 76.0293 117.7872 143.1211 167.0256 193.3755 207.2579 210.7240 217.2898 229.3193 253.5524 256.1281 264.0825 279.8109 291.8308 308.9008 342.5143 362.2996 391.2744 394.4749 415.2905 434.0807 479.1736 501.5823 535.2503 557.7486 577.5513 640.8581 708.4772 782.8757 793.9190 837.8614 859.8492 867.0870 877.0654 900.0691 925.9067 937.6529 956.1003 980.6140 986.8357 1005.7617 1020.3505 1027.5829 1033.7158 1047.7363 1056.5336 1077.1557 1081.4164 1124.1720 1152.6502 1164.5429 1178.1427 1198.8158 1200.1800 1211.7854 1232.8692 1267.0386 1283.0612 1299.0922 1335.1840 1339.5661 1348.4880 1360.7337 1368.6612 1371.8071 1380.9846 1387.6699 1391.4340 1395.5802 1450.2431 1453.9787 1457.2441 1457.8218 1463.9080 1465.5627 1469.3735 1471.0626 1473.6256 1478.4302 1479.0698 1481.8805 1491.8909 1647.1095 1660.0409 2938.1233 2947.9990 2956.0274 2962.3937 2967.7246 2971.8609 2974.5478 2978.6687 2979.1393 2994.1724 3021.3122 3022.4690 3041.8588 3052.7517 3056.2199 3060.9997 3064.3758 3065.3385 3073.5972 3078.0140 3091.9807 3095.1384 3096.4505 3548.9532
redmass: 3.4930 2.9333 3.2930 2.7530 2.6002 1.9882 1.3736 1.4443 1.3134 1.3489 1.6663 1.5142 1.4973 1.3338 1.9793 1.5164 2.2954 2.4442 2.5413 1.9943 2.7854 2.6264 2.9058 2.9861 3.3244 2.6693 2.4650 2.8561 2.9843 3.2109 3.0504 2.9198 2.6096 1.7164 2.2347 1.8093 2.1662 1.9128 1.5327 1.9627 1.7449 1.4440 1.5101 1.3670 1.9177 1.4539 2.1954 1.5610 1.7437 1.9951 1.7214 1.5712 2.4141 1.8773 1.9689 2.2501 2.1547 2.1499 1.2490 1.4966 2.0965 1.2059 1.4276 1.6203 1.6212 1.7346 1.2503 1.3160 1.2225 1.2047 1.2654 1.3915 1.0872 1.0623 1.0740 1.0688 1.0617 1.0532 1.0730 1.0714 1.0560 1.0595 1.0689 1.0535 1.0630 7.0098 7.2928 1.0623 1.0844 1.0402 1.0583 1.0352 1.0371 1.0379 1.0368 1.0752 1.0819 1.0958 1.0986 1.1029 1.0962 1.0897 1.0969 1.0969 1.0978 1.0994 1.0982 1.0994 1.0990 1.0963 1.0660
irintensity: 0.6642 0.9803 0.5128 1.2499 1.7335 0.6648 0.5088 0.2988 1.6955 1.3667 10.0780 30.5211 54.7758 43.1711 2.8453 3.2900 2.7502 0.0795 1.0603 3.1349 0.1757 5.4278 3.1539 1.1743 0.6745 0.2808 7.6879 3.2441 3.1870 5.9097 2.0964 7.9478 3.4197 1.7362 22.3540 19.7041 0.9451 6.0412 0.8878 0.7102 27.3832 8.6423 6.0422 3.4756 17.8312 44.2884 17.5337 1.7194 54.3161 10.2245 0.6385 1.8952 1.8328 31.4157 9.1169 6.8161 9.7633 2.0398 2.3557 2.9603 7.3550 7.7165 2.6440 0.4663 4.3487 26.8573 27.4862 5.4184 12.6295 18.6654 8.1822 12.6039 6.4001 12.5998 6.8684 12.9447 2.1892 5.4416 10.0012 6.0772 16.5053 6.4041 16.3150 6.3312 11.2486 3.9196 2.5083 38.1862 44.3644 62.3421 32.1705 26.1470 43.7190 29.4462 29.1785 18.1760 55.2616 29.0713 55.3583 64.0575 19.7438 15.0715 19.9321 45.5591 78.2538 16.8517 59.3180 26.7569 19.7164 14.1582 4.3708
temp: 298.150 k
press: 1.00000 atm
elementType: 8 6 6 6 6 6 6 6 6 6 6 6 6 6 6 1 1 1 1 1 1 1 1 1 1 1 1 1 1 1 1 1 1 1 1 1 1 1 1
symmnumber: 1
zpe: 904233.2 jmol-1
zpe.correction: 0.344404 hartree
zpe.thermalcorrener: 0.362436 hartree
zpe.thermalcorrenthalpy: 0.363380 hartree
zpe.thermalcorrgfe: 0.299340 hartree
zpe.sumelectzpe: -621.879230 hartree
zpe.sumelectthermal: -621.861199 hartree
zpe.sumelectthermalent: -621.860254 hartree
zpe.sumelectthermalfe: -621.924294 hartree
dipole: -0.4754 -1.3861 0.1873
dipole: 1.4773
quadrupole: -83.4350 -94.7599 -94.6927
quadrupole: 6.7363 0.6629 1.9631
quadrupole: 7.5276 -3.7974 -3.7302 6.7363 0.6629 1.9631
hfenergy: -622.2236347 hartree
pointgroup: C01 [X(C14H24O1)]
dipole: 0.1646228 -0.5428687 -0.1265683 debye
polarizability: 189.0797263|-6.9799162|158.3459863|-5.8272606|0.8147545|122.5536858 unknown
InChI: InChI=1S/C14H24O/c1-10-7-6-8-14(4,5)13(10)9-11(2)12(3)15/h9,12,15H,6-8H2,1-5H3
charge 0 multiplicity 1
39 atoms
O  4.087771 0.687208 0.502677
C  -1.666597 -1.090918 0.012241
C  -3.146783 -0.613499 0.081897
C  -0.686279 0.078755 0.306517
C  -3.367435 0.737249 -0.622889
C  -2.532886 1.820573 0.0853
C  -1.097769 1.389923 0.373563
C  -1.359273 -1.673503 -1.400289
C  -1.491508 -2.232257 1.058266
C  0.729377 -0.319677 0.55108
C  -0.192029 2.537784 0.784048
C  1.844984 0.073212 -0.136461
C  3.202672 -0.48574 0.277152
C  1.839144 1.025443 -1.31242
C  3.826608 -1.43885 -0.767474
H  -3.440423 -0.509053 1.14704
H  -3.794516 -1.39882 -0.355965
H  -4.439912 1.011146 -0.61283
H  -3.064732 0.665183 -1.685733
H  -3.020771 2.104064 1.04382
H  -2.509805 2.751102 -0.519324
H  -1.573301 -0.936787 -2.195431
H  -0.293791 -1.955947 -1.482737
H  -1.972474 -2.575851 -1.589528
H  -2.285184 -2.99063 0.916392
H  -0.519627 -2.746645 0.952729
H  -1.571175 -1.844297 2.091059
H  0.88447 -1.045551 1.365809
H  0.051114 3.188938 -0.080423
H  0.75771 2.191204 1.221272
H  -0.709725 3.180397 1.523999
H  3.080989 -1.03875 1.233955
H  2.303393 1.987765 -1.026614
H  0.812542 1.218436 -1.663915
H  2.435177 0.627263 -2.154957
H  4.027659 -0.910663 -1.715921
H  3.148801 -2.286314 -0.974965
H  4.784084 -1.855274 -0.39715
H  5.016601 0.363984 0.62851
