program: Gaussian 09
title: 000103490
version: EM64L-G09RevD.01
frameworkgroup: C1[X(C14H24O)]
method: RPBEPBE
basis: SDD
operation: Freq
keyword: #pfreq=noraman
keyword: PBEPBE/SDD
title: #p freq=noraman PBEPBE/SDD
converged: YES YES NO NO
title: Mulliken charges:
elementType: O C C C C C C C C C C C C C C H H H H H H H H H H H H H H H H H H H H H H H H
charge: -0.237867 -0.102704 -0.274304 -0.435182 -0.357946 -0.354999 -0.389440 -0.391311 -0.194005 -0.384848 -0.372995 -0.384906 -0.373827 -0.166275 -0.491560 0.222258 0.230011 0.198989 0.218778 0.211204 0.201006 0.225062 0.193571 0.200620 0.196177 0.191466 0.190131 0.256965 0.195867 0.194399 0.200135 0.199323 0.188783 0.185468 0.197225 0.203263 0.207576 0.194115 0.209777
chargesum: 0.00000
title: Mulliken charges with hydrogens summed into heavy atoms:
elementType: O C C C C C C C C C C C C C C
charge: -0.237867 0.119554 -0.044293 -0.017415 0.054264 0.063634 0.007357 -0.009714 0.062960 0.005418 0.026463 -0.010655 0.026661 0.041301 -0.087668
polarizability: 1.76107764e+02 6.51811677e+00 1.47239682e+02 1.14543086e+00 1.75009628e+00 1.23010630e+02
1716.lowfreq: -18.1952 -7.2382 -2.1240 0.0003 0.0006 0.0007 51.8100 55.5263 82.2833
frequency: 51.2303 55.3262 82.1634 92.9047 109.5674 141.7991 182.1855 202.5833 228.4244 234.2319 248.7225 272.2007 285.3700 304.1963 346.8162 367.6842 406.3895 426.6675 449.2882 500.0643 546.2436 632.7939 687.9919 700.6519 747.4627 770.5733 793.3160 818.6605 826.7174 832.2749 843.5244 869.3915 892.3609 905.3519 946.4290 953.2412 959.5201 981.4936 989.2702 995.2030 1019.1707 1023.5314 1047.7328 1050.9593 1072.8530 1088.4624 1104.4917 1112.8621 1120.5094 1128.1177 1138.4411 1148.9822 1159.8620 1173.7988 1203.3927 1206.9635 1219.4192 1237.8392 1256.2942 1261.4210 1277.1066 1283.3516 1289.1187 1296.9138 1301.6769 1306.5825 1315.6247 1321.1118 1330.1388 1339.8569 1341.4619 1350.0379 1352.0113 1357.5520 1361.2169 1365.2334 1455.9822 1457.8586 1460.2343 1461.0148 1467.6386 1469.0315 1475.4632 1479.1987 1483.7258 1490.1290 1671.8241 2951.4931 2953.5590 2956.8903 2963.2765 2965.2624 2966.9166 2970.7811 2971.6290 2972.8797 2977.5762 2981.7488 3004.7347 3007.7808 3016.8494 3020.0667 3020.9492 3029.6009 3034.5069 3036.1578 3042.7574 3058.4267 3065.0342 3068.1969 3079.4593
redmass: 4.2155 2.8651 3.2498 2.8757 3.1161 2.6473 2.3574 2.4190 2.4766 1.9695 2.6036 2.5882 2.4813 2.0454 2.1647 3.0128 2.3724 2.3476 2.5093 2.0610 2.5083 3.1483 2.5398 1.6249 1.3904 2.4736 1.7296 1.8404 2.1295 2.5189 2.5905 2.2880 2.0983 2.3041 1.7431 1.9846 1.9703 2.6011 1.1760 1.6730 1.6994 3.0481 1.7594 2.3952 2.0534 1.9214 2.1236 2.5583 2.1570 1.9269 1.1397 1.3288 1.5337 1.3685 1.4510 1.3907 1.3059 1.3082 1.2319 1.2382 1.2093 1.2158 1.2957 1.2526 1.2212 1.2484 1.2162 1.2825 1.2497 1.3866 1.4088 1.4156 1.3425 1.5308 1.4562 1.4975 1.0736 1.0896 1.0830 1.0875 1.0969 1.0905 1.0803 1.0857 1.0925 1.0870 6.5811 1.0606 1.0674 1.0600 1.0707 1.0610 1.0728 1.0624 1.0638 1.0650 1.0648 1.0624 1.0991 1.0988 1.0920 1.0981 1.0912 1.0973 1.1031 1.0981 1.1011 1.0954 1.0961 1.0944 1.0879
irintensity: 8.3702 0.5107 2.4364 1.1393 0.2246 0.2926 0.1587 0.1801 0.6338 0.1936 0.1332 0.4852 0.2467 0.9121 0.2612 1.8363 1.3658 0.1654 0.7299 1.1691 2.7275 6.0734 1.2020 17.6875 13.2666 2.9894 2.4734 2.5170 0.5677 7.5402 9.0146 5.4229 3.8729 7.6484 0.3003 6.5250 15.9306 8.9883 39.8355 4.4949 1.5900 52.8770 1.7916 5.7515 5.7158 2.0340 1.7646 1.6847 0.3688 1.9756 0.9463 0.9409 1.9841 1.9588 1.5462 4.9949 5.3266 3.3030 2.3975 2.9712 2.4611 0.6772 0.9261 0.6087 1.2212 0.6798 0.4727 2.4188 0.9738 1.0610 1.9733 0.7149 0.9319 0.7622 1.3455 3.5508 2.5864 10.4782 6.5085 7.6340 9.8822 4.8525 0.2906 3.3364 27.1336 5.0926 0.8221 29.4467 89.6221 31.4562 7.1259 20.5243 19.4433 12.7704 53.7636 127.3655 40.6837 28.5210 41.5030 7.4331 23.6982 24.9184 28.7153 29.6702 39.3366 116.1618 117.5605 88.4499 16.9651 19.4756 58.2022
temp: 298.150 k
press: 1.00000 atm
elementType: 8 6 6 6 6 6 6 6 6 6 6 6 6 6 6 1 1 1 1 1 1 1 1 1 1 1 1 1 1 1 1 1 1 1 1 1 1 1 1
symmnumber: 1
zpe: 921920.2 jmol-1
zpe.correction: 0.351141 hartree
zpe.thermalcorrener: 0.366467 hartree
zpe.thermalcorrenthalpy: 0.367411 hartree
zpe.thermalcorrgfe: 0.309039 hartree
zpe.sumelectzpe: -621.865032 hartree
zpe.sumelectthermal: -621.849707 hartree
zpe.sumelectthermalent: -621.848763 hartree
zpe.sumelectthermalfe: -621.907135 hartree
dipole: -2.2162 1.0752 -0.9423
dipole: 2.6374
quadrupole: -104.5031 -92.8834 -92.0844
quadrupole: 5.8390 -4.3580 0.9639
quadrupole: -8.0128 3.6069 4.4059 5.8390 -4.3580 0.9639
hfenergy: -622.2161733 hartree
pointgroup: C01 [X(C14H24O1)]
dipole: -0.8678278 -0.425583 0.377379 debye
polarizability: 176.2276896|-6.2611598|147.1661976|-1.079262|1.3767911|122.9641889 unknown
InChI: InChI=1S/C14H24O/c1-2-4-6-8-10-14-12-15-11-13(14)9-7-5-3-1/h7,9,13-14H,1-6,8,10-12H2
charge 0 multiplicity 1
39 atoms
O  3.760388 0.625617 -0.606857
C  2.014456 -0.947247 0.06896
C  1.782173 0.442143 0.781258
C  0.745073 -1.654069 -0.450468
C  3.023646 -0.586586 -1.050259
C  3.210835 1.034776 0.708755
C  -0.202793 -2.12973 0.676804
C  -1.580961 -2.637006 0.17406
C  0.759901 1.318595 0.086368
C  -2.475785 -1.541136 -0.465396
C  -2.990347 -0.479739 0.539704
C  -3.551044 0.807884 -0.122492
C  -2.543302 1.677536 -0.92092
C  -0.441834 1.668816 0.617234
C  -1.501124 2.495386 -0.09138
H  2.519495 -1.605993 0.806323
H  1.478305 0.290502 1.834044
H  1.036815 -2.526466 -1.072153
H  0.210266 -0.954334 -1.120505
H  3.754946 -1.394021 -1.240585
H  2.503487 -0.344095 -1.999255
H  3.233207 2.137364 0.741713
H  3.847877 0.628707 1.522859
H  -0.358414 -1.300979 1.394513
H  0.296001 -2.940014 1.247547
H  -2.126648 -3.097337 1.023842
H  -1.416807 -3.447466 -0.566221
H  1.030216 1.679538 -0.919365
H  -3.346369 -2.022821 -0.955621
H  -1.910023 -1.043364 -1.275953
H  -2.178831 -0.207274 1.237233
H  -3.788928 -0.935159 1.161296
H  -4.020446 1.44113 0.659162
H  -4.370445 0.513575 -0.811758
H  -3.127018 2.407684 -1.518534
H  -1.994485 1.051164 -1.651292
H  -0.683685 1.314133 1.631727
H  -2.048523 3.116532 0.646187
H  -0.999976 3.195557 -0.789072
