program: Gaussian 09
title: 000103517
version: EM64L-G09RevD.01
frameworkgroup: C1[X(C15H26NO3P)]
method: RPBEPBE
basis: SDD
operation: Freq
keyword: #p
keyword: freq=noraman
keyword: PBEPBE/SDD
title: #p freq=noraman PBEPBE/SDD
converged: NO YES NO NO
title: Mulliken charges:
elementType: P O O O N C C C C C C C C C C C C C C C H H H H H H H H H H H H H H H H H H H H H H H H H H
charge: 1.290823 -0.537197 -0.500173 -0.624832 -0.076480 -0.762349 -0.346994 -0.344094 0.566079 -0.364920 -0.441798 -0.211989 -0.223775 -0.617044 -0.624732 -0.243244 -0.225829 -0.243069 -0.656881 -0.657536 0.275897 0.250805 0.235029 0.161250 0.239581 0.275775 0.230599 0.241939 0.211149 0.195845 0.231512 0.222171 0.230135 0.184588 0.235653 0.221858 0.182080 0.228783 0.226205 0.229199 0.235940 0.223061 0.207969 0.230065 0.234836 0.204109
chargesum: 0.00000
title: Mulliken charges with hydrogens summed into heavy atoms:
elementType: P O O O N C C C C C C C C C C C C C C C
charge: 1.290823 -0.537197 -0.500173 -0.624832 -0.076480 -0.486452 0.138840 0.056737 0.566079 -0.089146 -0.211199 0.241099 0.203582 0.019850 0.014859 -0.014461 0.000377 -0.013870 0.010089 0.011474
polarizability: 1.94857998e+02 1.57200269e+00 2.39804901e+02 -1.23927408e+00 2.12659309e+00 1.75505328e+02
1716.lowfreq: -21.5464 -10.4411 -9.7633 -6.4269 -0.0009 0.0004 0.0012 8.7254 15.4294
frequency: -19.3538 -6.4571 15.0762 19.1151 27.2813 32.8428 38.9519 42.3619 64.0638 79.7754 104.6675 120.7440 131.9880 172.1803 180.5018 197.1966 203.6347 217.0032 231.3459 233.0302 238.0460 241.3909 252.1552 274.6794 295.3165 329.7982 360.9095 394.0045 401.3137 411.7171 414.9268 463.1277 503.3207 537.9286 574.4177 614.0582 631.6354 673.4521 701.2016 711.6294 760.1485 780.0789 805.5991 807.9290 821.1387 836.1483 850.1529 876.1968 880.6204 923.6474 974.5484 988.9559 995.5280 1004.9090 1013.7171 1018.9134 1023.3710 1030.1895 1034.1982 1042.9632 1053.8597 1072.8920 1087.0367 1093.5952 1102.1260 1104.3245 1129.0492 1130.0276 1137.1974 1163.6453 1172.3810 1193.0618 1195.5654 1211.0620 1238.1959 1249.8602 1253.3731 1264.2602 1294.6978 1305.6642 1318.6048 1339.6631 1350.6945 1356.3951 1379.8291 1382.8259 1392.7119 1392.9708 1418.7790 1441.5074 1442.3418 1455.7974 1458.2524 1460.9308 1462.2212 1472.7905 1475.8860 1477.3198 1478.8039 1481.3426 1482.4595 1487.3081 1489.6926 1493.1033 1591.4585 1610.8676 2799.8267 2837.9032 2856.8304 2959.7397 2988.5452 2992.6960 2993.5563 3004.3420 3010.4000 3020.0496 3027.8387 3031.1108 3037.1902 3053.3227 3072.2729 3079.6633 3087.4419 3087.7612 3090.4686 3105.8031 3108.6383 3118.0822 3127.1007 3138.4079 3148.7712 3163.9186
redmass: 1.8463 2.4725 3.2966 2.6578 3.3495 3.2661 3.6258 3.4889 3.6396 4.3134 2.3852 3.7931 4.7613 3.6859 3.9944 3.5211 2.6754 1.3832 1.8364 1.7285 1.5339 1.7338 1.5669 3.0961 4.3713 2.3320 5.0905 3.0606 2.8132 4.4683 3.1389 3.1252 4.9456 3.4572 3.9977 6.3184 5.7269 6.2681 2.0151 2.8622 2.1515 2.1235 1.0927 1.0930 2.4342 2.3557 1.2512 3.8511 3.6024 1.4753 1.4161 4.8358 1.3925 2.7554 2.7706 2.7177 2.8100 2.0171 1.6565 5.4512 2.1798 2.1773 1.5399 1.4914 2.1680 2.2229 1.3604 1.4163 1.4575 1.6104 1.0605 1.1556 1.8685 1.3945 1.7380 1.1772 1.1417 2.6270 1.4102 1.2408 1.4122 1.2735 1.2646 1.2538 1.3768 6.4453 1.2444 1.2481 1.1421 1.3642 1.6971 1.0403 1.0407 1.0659 1.0544 1.0725 1.0665 1.0548 1.0490 1.2426 1.7027 1.0653 1.0813 1.0846 6.0093 6.0125 1.0706 1.0578 1.0575 1.0608 1.0478 1.0454 1.0369 1.0619 1.0833 1.0717 1.0820 1.0737 1.1020 1.1070 1.1020 1.1010 1.1004 1.0982 1.0982 1.1022 1.1016 1.0865 1.0869 1.0919 1.0963 1.1016
irintensity: 1.4208 0.5265 0.1720 0.5766 0.0162 1.6746 0.0921 2.4381 0.7386 2.2557 1.3905 2.9197 0.6856 4.3595 8.8663 1.8054 3.7387 1.4500 0.9823 2.9786 1.6669 0.9336 1.1533 13.6669 11.3749 9.6562 7.2423 4.9270 0.5546 16.3697 7.1831 15.2454 39.4840 30.7414 6.6430 1.8122 88.9514 107.7810 57.5779 13.8111 14.5927 34.9264 4.1475 2.1093 8.6437 4.6294 0.7191 173.0144 167.9061 5.5939 0.6263 0.4715 0.7287 19.7516 62.5877 101.2995 133.6290 3.0859 18.6887 44.9351 23.8412 19.5791 10.1770 5.9865 5.3247 18.2325 9.9231 1.5170 3.9856 14.7533 0.2447 0.6530 2.6592 17.8521 0.5238 0.9483 1.5460 8.7985 5.5946 9.4956 7.2334 0.8883 9.0636 6.3283 8.7455 0.1558 13.3471 38.0162 3.7769 5.1768 7.5804 10.6846 10.9579 7.7947 21.0534 4.2062 13.4405 2.5506 4.0169 15.5465 15.2629 32.4520 3.1967 5.0409 1.4320 4.6999 76.4416 76.4997 212.1633 40.6764 27.0717 38.2349 29.5605 5.6684 8.9398 40.7045 32.1264 29.7671 21.3783 10.6923 18.0589 35.7867 51.3856 25.9803 29.0923 35.8350 34.7873 5.7901 0.5855 19.2013 22.9429 24.6592
temp: 298.150 k
press: 1.00000 atm
elementType: 15 8 8 8 7 6 6 6 6 6 6 6 6 6 6 6 6 6 6 6 1 1 1 1 1 1 1 1 1 1 1 1 1 1 1 1 1 1 1 1 1 1 1 1 1 1
symmnumber: 1
zpe: 1014396.5 jmol-1
zpe.correction: 0.386363 hartree
zpe.thermalcorrener: 0.409434 hartree
zpe.thermalcorrenthalpy: 0.410378 hartree
zpe.thermalcorrgfe: 0.330176 hartree
zpe.sumelectzpe: -1207.230985 hartree
zpe.sumelectthermal: -1207.207914 hartree
zpe.sumelectthermalent: -1207.206970 hartree
zpe.sumelectthermalfe: -1207.287172 hartree
dipole: -0.3066 0.1050 -4.7739
dipole: 4.7849
quadrupole: -118.9642 -117.9847 -136.0766
quadrupole: 1.7917 -2.1908 6.8416
quadrupole: 5.3776 6.3571 -11.7348 1.7917 -2.1908 6.8416
hfenergy: -1207.617348 hartree
pointgroup: C01 [X(C15H26N1O3P1)]
dipole: 0.0193048 0.0416423 1.8819587 debye
polarizability: 195.4058481|4.7903643|239.3289359|-0.4463859|-2.262429|175.4334432 unknown
InChI: InChI=1S/C15H26NO3P/c1-5-18-20(17,19-6-2)15(12-13-16(3)4)14-10-8-7-9-11-14/h7-11,15H,5-6,12-13H2,1-4H3
charge 0 multiplicity 1
46 atoms
P  -1.427357 -0.788965 -0.753158
O  -2.697354 -0.092768 0.216777
O  -1.573482 -2.515577 -0.500276
O  -1.475937 -0.442607 -2.305166
N  3.790024 -1.494555 0.010861
C  0.115809 -0.261829 0.215166
C  1.337438 -1.050149 -0.333872
C  2.578968 -0.84559 0.560371
C  0.277657 1.251648 0.179684
C  0.471495 1.93364 -1.051116
C  0.267224 1.997795 1.384718
C  -3.934119 0.394362 -0.462335
C  -1.923635 -3.043603 0.846817
C  5.024174 -0.992063 0.649263
C  3.727357 -2.969912 0.024073
C  0.65972 3.332624 -1.067886
C  0.458928 3.397893 1.367537
C  0.657971 4.069809 0.139707
C  -4.60186 1.369572 0.503587
C  -2.248099 -4.5236 0.65634
H  -0.08991 -0.583725 1.254444
H  1.581052 -0.717447 -1.359086
H  1.074617 -2.123067 -0.393426
H  2.347904 -1.208206 1.600469
H  2.78611 0.237882 0.637334
H  0.449879 1.371822 -1.991728
H  0.105403 1.481251 2.33876
H  -3.652088 0.877783 -1.416179
H  -4.583348 -0.474273 -0.684311
H  -1.060336 -2.90904 1.531754
H  -2.785857 -2.478804 1.248833
H  5.905648 -1.429824 0.147266
H  5.079174 0.10555 0.539537
H  5.094178 -1.235361 1.740847
H  2.882708 -3.327994 -0.588297
H  4.653925 -3.379511 -0.415705
H  3.61611 -3.395109 1.055777
H  0.80219 3.848997 -2.02384
H  0.451443 3.961405 2.30743
H  0.806092 5.155425 0.123449
H  -3.932275 2.219772 0.717699
H  -4.850189 0.870394 1.456095
H  -5.536669 1.759275 0.058948
H  -1.381142 -5.061515 0.236558
H  -3.097823 -4.644253 -0.036439
H  -2.513215 -4.983852 1.62662
