program: Gaussian 09
title: 000103463
version: EM64L-G09RevD.01
frameworkgroup: C1[X(C11H18O)]
method: RPBEPBE
basis: SDD
operation: Freq
keyword: #pfreq=noraman
keyword: PBEPBE/SDD
title: #p freq=noraman PBEPBE/SDD
converged: YES YES NO NO
title: Mulliken charges:
elementType: O C C C C C C C C C C C H H H H H H H H H H H H H H H H H H
charge: -0.267737 -0.158649 0.441613 -0.360800 -0.118908 -0.430200 -0.712970 -0.820889 -0.314072 0.368091 -0.784648 -0.792306 0.190400 0.214381 0.188103 0.196963 0.240364 0.212613 0.242004 0.209314 0.223397 0.220700 0.228840 0.249043 0.232277 0.219329 0.213835 0.221716 0.220949 0.227246
chargesum: 0.00000
title: Mulliken charges with hydrogens summed into heavy atoms:
elementType: O C C C C C C C C C C C
charge: -0.267737 0.031752 0.441613 0.041684 0.078055 -0.189836 -0.049038 -0.147952 -0.065029 0.368091 -0.119207 -0.122395
polarizability: 1.75311557e+02 4.59317089e+00 1.02650530e+02 -4.79828844e+00 -7.35310373e-01 9.86960311e+01
1716.lowfreq: -19.3997 -8.8730 -0.0003 -0.0002 0.0006 4.7694 23.4581 43.9353 75.8360
frequency: 21.9587 43.6860 75.7776 112.1133 122.8828 163.8971 175.7981 203.7286 212.1547 237.0418 246.4062 296.1499 315.8450 361.2296 398.8666 418.8139 434.1748 473.4202 501.3557 576.2349 606.2904 700.5513 761.3519 807.9758 823.0591 846.8521 873.0454 887.8947 946.0518 948.5444 961.4022 990.9797 995.0855 1022.0605 1031.0562 1045.5921 1081.8497 1084.9323 1109.7855 1112.8223 1147.4777 1169.5654 1197.0110 1231.2307 1256.4708 1269.7394 1291.1667 1300.2839 1335.2996 1352.6835 1366.3043 1384.9375 1388.3229 1393.0153 1399.3245 1454.9226 1457.0060 1459.4196 1463.9554 1469.8130 1471.7697 1472.8353 1475.2100 1480.4952 1681.9144 1694.7085 2917.5891 2938.6474 2957.0170 2959.7217 2960.3998 2966.0684 2979.9291 3031.4493 3031.4982 3035.3598 3062.6898 3072.1479 3077.8885 3083.9460 3089.3131 3091.7483 3105.5723 3106.2894
redmass: 2.8823 3.3882 2.6618 1.1769 1.5384 1.2868 1.2190 1.1521 2.6531 2.3565 3.4746 3.0014 2.6222 2.2087 2.5069 4.0118 3.1016 2.3498 3.1135 2.8700 3.9051 3.1910 3.4263 1.6759 2.3354 1.5307 2.6564 2.3501 1.5820 1.6896 1.7864 1.4568 1.6215 1.5963 1.8910 1.7658 1.8329 2.1795 1.8867 2.2996 1.8376 2.0420 1.9495 1.2492 1.3588 1.4376 1.6106 1.3772 1.7323 1.5443 1.3572 1.3027 1.2791 1.2183 1.2214 1.0501 1.0789 1.0525 1.0487 1.0653 1.0446 1.0857 1.0486 1.0581 7.2022 6.6548 1.0814 1.0705 1.0722 1.0377 1.0424 1.0386 1.0362 1.0969 1.0966 1.0963 1.0972 1.0988 1.0984 1.0983 1.1002 1.0959 1.0899 1.0908
irintensity: 0.3510 0.9941 0.8253 0.4638 0.9069 0.6457 1.1539 1.1935 1.0501 2.5014 1.1744 1.8606 1.4346 1.3746 1.2657 3.2629 1.6654 8.0291 5.2169 5.6627 0.4274 5.4054 1.6117 9.4359 6.3689 19.2787 14.4192 2.6752 5.4663 2.9421 27.0402 15.0963 7.7545 21.7792 30.6270 6.5030 2.1287 15.0002 45.6516 5.1459 6.5722 4.4234 4.6750 8.0628 4.0334 0.3515 1.3331 0.8832 6.3564 3.1067 5.1436 20.7061 25.3510 12.4545 12.0787 1.5746 3.3270 18.4371 11.2296 6.3358 24.0988 7.2433 14.9050 10.8612 16.5955 9.2296 45.2538 32.4364 84.3128 61.0095 46.5197 57.6438 42.0153 9.7467 24.1616 44.0060 22.2535 61.2298 21.7148 25.4098 32.2018 31.3726 23.1704 15.2654
temp: 298.150 k
press: 1.00000 atm
elementType: 8 6 6 6 6 6 6 6 6 6 6 6 1 1 1 1 1 1 1 1 1 1 1 1 1 1 1 1 1 1
symmnumber: 1
zpe: 685226.2 jmol-1
zpe.correction: 0.260989 hartree
zpe.thermalcorrener: 0.275088 hartree
zpe.thermalcorrenthalpy: 0.276032 hartree
zpe.thermalcorrgfe: 0.219588 hartree
zpe.sumelectzpe: -504.199088 hartree
zpe.sumelectthermal: -504.184988 hartree
zpe.sumelectthermalent: -504.184044 hartree
zpe.sumelectthermalfe: -504.240488 hartree
dipole: -0.4371 1.5002 -0.6456
dipole: 1.6907
quadrupole: -64.3508 -76.8278 -73.3092
quadrupole: 2.1305 0.4576 0.4802
quadrupole: 7.1452 -5.3319 -1.8133 2.1305 0.4576 0.4802
hfenergy: -504.4600764 hartree
pointgroup: C01 [X(C11H18O1)]
dipole: -0.1717376 -0.6168463 0.1801854 debye
polarizability: 175.059468|-4.3917023|102.6728889|6.6637486|-0.3687767|98.9257618 unknown
InChI: InChI=1S/C11H18O/c1-8(2)5-11-6-9(3)10(4)7-12-11/h5-6,10-11H,7H2,1-4H3
charge 0 multiplicity 1
30 atoms
O  -0.298161 1.374498 0.454204
C  -2.539876 0.349704 0.125136
C  -1.830147 -0.998632 -0.015429
C  -1.66838 1.289437 0.987205
C  0.415121 0.077218 0.556749
C  -0.491552 -1.099157 0.210832
C  -2.862919 0.98905 -1.252041
C  -2.681011 -2.196422 -0.390003
C  1.58854 0.165564 -0.395008
C  2.903833 -0.058144 -0.115181
C  3.954896 0.057968 -1.208173
C  3.45567 -0.432664 1.249849
H  -3.498059 0.180646 0.664003
H  -2.043522 2.327396 0.964581
H  -1.646416 0.93093 2.039933
H  0.772069 -0.039612 1.605091
H  0.013187 -2.072341 0.14069
H  -3.507624 1.879644 -1.129796
H  -1.92619 1.304276 -1.744482
H  -3.386717 0.281233 -1.919535
H  -3.192519 -2.038907 -1.360031
H  -3.476055 -2.370459 0.362258
H  -2.077737 -3.117244 -0.471904
H  1.297328 0.432189 -1.42045
H  3.506461 0.308924 -2.18459
H  4.696666 0.842228 -0.957282
H  4.520806 -0.888523 -1.320315
H  3.89738 -1.449073 1.227462
H  4.270902 0.259974 1.53733
H  2.696325 -0.414203 2.048497
