program: Gaussian 09
title: 000103460
version: EM64L-G09RevD.01
frameworkgroup: C1[X(C12H22O)]
method: RPBEPBE
basis: SDD
operation: Freq
keyword: #pfreq=noraman
keyword: PBEPBE/SDD
title: #p freq=noraman PBEPBE/SDD
converged: YES YES NO NO
title: Mulliken charges:
elementType: O C C C C C C C C C C C C H H H H H H H H H H H H H H H H H H H H H H
charge: -0.213742 -0.384516 -0.368626 -0.372201 -0.397573 -0.353026 -0.523821 -0.356568 0.395808 -0.696601 -0.276739 -0.231715 -0.730572 0.197583 0.190554 0.187645 0.199571 0.191532 0.187616 0.236201 0.199134 0.186681 0.189284 0.227877 0.202051 0.193955 0.195542 0.210298 0.214685 0.209118 0.225898 0.166404 0.225729 0.235810 0.236722
chargesum: 0.00000
title: Mulliken charges with hydrogens summed into heavy atoms:
elementType: O C C C C C C C C C C C C
charge: -0.213742 0.003621 0.018590 0.006947 0.037762 0.022940 -0.093892 0.032929 0.395808 -0.062500 -0.050840 -0.065311 -0.032311
polarizability: 1.72881077e+02 -1.67932078e+01 1.33396107e+02 -6.80028316e+00 2.22340850e-01 1.04710129e+02
1716.lowfreq: -3.4833 -0.0006 -0.0005 0.0008 6.7022 11.9049 26.8037 42.8989 44.9688
frequency: 26.8027 42.5152 43.6770 58.1556 89.7762 101.0250 109.2949 115.9158 139.9525 150.8904 159.6438 174.1453 211.0936 232.6651 251.8293 275.9492 294.8777 338.5680 419.3170 453.9923 497.0038 538.7109 603.5959 721.5908 727.2384 743.8740 780.8441 810.1027 857.2556 861.2499 888.9939 929.4016 966.0809 972.3396 988.0228 1009.5365 1014.0040 1041.4356 1045.3199 1058.0010 1078.3982 1080.2945 1086.1585 1119.7881 1123.8089 1187.2090 1214.4640 1224.3619 1244.4135 1256.9740 1261.3815 1281.6127 1284.7559 1294.3223 1294.7638 1299.0336 1325.7617 1344.5137 1354.8910 1355.3474 1356.9914 1390.1375 1391.1626 1403.8259 1455.6645 1461.7466 1461.8455 1462.5685 1465.8893 1467.1410 1471.4473 1477.7059 1478.2916 1484.5424 1488.8023 1582.8572 1647.4269 2907.0492 2949.5256 2950.7886 2953.0416 2960.0261 2967.6589 2971.5590 2972.2004 2973.8778 2983.1842 2984.6765 2992.0777 3003.6363 3019.7092 3030.6899 3038.7735 3040.4079 3058.4859 3068.1303 3069.9585 3073.3057 3110.8855
redmass: 4.0478 2.0939 2.6216 3.6171 1.7259 2.7471 2.8400 1.1467 1.8033 2.1419 2.5675 3.4609 2.7031 1.1215 3.8464 2.9119 2.8008 3.0132 3.2887 2.8723 3.0671 3.1342 3.7688 1.0609 1.0802 1.1385 1.2917 2.0164 1.4162 1.3467 1.8814 1.3117 1.7794 1.6413 3.7837 1.1652 3.8125 2.3000 1.9440 3.0005 2.3558 2.1750 1.8073 2.5899 1.9024 1.7487 1.2753 1.4549 1.8853 1.3791 1.2632 1.0267 1.1725 1.1397 1.2450 1.1327 1.3835 1.4606 1.5989 1.6438 1.3783 1.2185 1.4619 1.2533 1.1011 1.0562 1.0642 1.0716 1.0712 1.0992 1.0816 1.0430 1.0809 1.0881 1.0923 7.4948 5.5126 1.0842 1.0590 1.0589 1.0594 1.0594 1.0588 1.0372 1.0618 1.0395 1.0680 1.0887 1.0966 1.1005 1.1022 1.1014 1.1044 1.0960 1.1042 1.1006 1.0993 1.0895 1.0962
irintensity: 1.5685 0.2824 0.5226 1.4668 0.0545 0.0729 0.8866 0.0307 0.1220 0.3044 3.3213 2.6867 3.9334 0.0030 4.7378 2.3728 2.8432 0.8373 1.0511 1.7870 7.1581 7.6777 2.1204 14.5381 0.1981 2.4744 4.2746 14.3882 10.3296 12.5022 4.7938 1.2676 0.5178 5.9765 1.6274 3.4856 2.3084 0.7855 0.3038 0.1512 0.3209 0.2173 0.6504 19.4756 13.4939 1.9925 13.5680 2.8185 15.0791 3.7203 0.3909 1.1530 2.0646 1.2814 0.3186 1.3891 1.3275 0.4774 0.6861 2.5049 32.3391 11.3211 13.6318 2.7054 4.6824 9.0524 6.0191 0.5030 1.2239 29.1972 2.4113 12.2996 2.4588 3.6676 28.7118 158.1516 36.5744 110.0748 1.8603 2.2797 0.4914 32.1212 116.1058 32.1915 40.2440 24.8664 33.5096 22.2476 6.0719 3.3864 1.3256 10.7705 93.0406 16.7320 66.5084 98.4686 56.1891 14.9963 33.7893
temp: 298.150 k
press: 1.00000 atm
elementType: 8 6 6 6 6 6 6 6 6 6 6 6 6 1 1 1 1 1 1 1 1 1 1 1 1 1 1 1 1 1 1 1 1 1 1
symmnumber: 1
zpe: 816359.4 jmol-1
zpe.correction: 0.310935 hartree
zpe.thermalcorrener: 0.327919 hartree
zpe.thermalcorrenthalpy: 0.328863 hartree
zpe.thermalcorrgfe: 0.264283 hartree
zpe.sumelectzpe: -544.614717 hartree
zpe.sumelectthermal: -544.597734 hartree
zpe.sumelectthermalent: -544.596790 hartree
zpe.sumelectthermalfe: -544.661370 hartree
dipole: 1.4138 -3.6064 -0.1735
dipole: 3.8775
quadrupole: -70.1633 -88.2036 -82.7958
quadrupole: -12.6749 -3.0077 0.1647
quadrupole: 10.2242 -7.8160 -2.4082 -12.6749 -3.0077 0.1647
hfenergy: -544.9256522 hartree
pointgroup: C01 [X(C12H22O1)]
dipole: 0.5381667 1.4261836 -0.0601691 debye
polarizability: 172.439036|17.8346735|133.6488317|5.2619633|-2.2974767|104.899445 unknown
InChI: InChI=1S/C12H22O/c1-3-5-6-7-8-9-10-12(4-2)11-13/h4,11H,3,5-10H2,1-2H3
charge 0 multiplicity 1
35 atoms
O  3.107086 -2.255944 0.357636
C  -1.80163 0.086249 0.245078
C  -0.581103 0.058722 -0.702109
C  -3.154594 0.040658 -0.500651
C  0.768668 0.10361 0.047546
C  -4.376469 0.063098 0.445135
C  1.983731 0.074961 -0.92024
C  -5.729528 0.017499 -0.301194
C  3.321017 0.094843 -0.195022
C  -6.944743 0.038584 0.651135
C  4.08409 1.236517 -0.113971
C  3.761773 -1.175188 0.4298
C  5.410883 1.456879 0.574271
H  -1.739804 -0.773165 0.944625
H  -1.759993 1.001301 0.872618
H  -0.643027 0.915921 -1.405836
H  -0.621155 -0.859545 -1.324246
H  -3.194997 -0.873683 -1.129097
H  -3.216931 0.900848 -1.200183
H  0.837374 -0.760873 0.735064
H  0.818152 1.019385 0.671452
H  -4.337559 0.976652 1.075166
H  -4.315971 -0.79771 1.143708
H  1.915469 -0.849793 -1.525379
H  1.919946 0.935997 -1.613889
H  -5.789295 0.877789 -0.999093
H  -5.766725 -0.89527 -0.930482
H  -6.923238 -0.82785 1.339023
H  -7.899063 0.004002 0.093794
H  -6.947228 0.956112 1.269733
H  3.685803 2.13066 -0.620582
H  4.730717 -1.151452 0.982733
H  5.801454 0.568276 1.093537
H  5.322613 2.275701 1.314987
H  6.170977 1.785113 -0.161568
