program: Gaussian 09
title: 000103458
version: EM64L-G09RevD.01
frameworkgroup: C1[X(C6H9ClO2S)]
method: RPBEPBE
basis: SDD
operation: Freq
keyword: #p
keyword: freq=noraman
keyword: PBEPBE/SDD
title: #p freq=noraman PBEPBE/SDD
converged: YES YES NO NO
title: Mulliken charges:
elementType: Cl S O O C C C C C C H H H H H H H H H
charge: -0.098952 0.181688 -0.086572 -0.185081 -0.074343 -0.714351 -0.666616 -0.012433 -0.001218 -0.708350 0.307653 0.284592 0.294433 0.224279 0.248799 0.240514 0.255376 0.253282 0.257299
chargesum: 0.00000
title: Mulliken charges with hydrogens summed into heavy atoms:
elementType: Cl S O O C C C C C C
charge: -0.098952 0.181688 -0.086572 -0.185081 0.233310 -0.135326 0.046976 -0.012433 -0.001218 0.057606
polarizability: 1.09470441e+02 5.31449508e+00 8.56399636e+01 1.06357721e+00 -2.38675627e+00 9.52412621e+01
1716.lowfreq: -58.3347 -17.6065 -5.9100 -0.0035 -0.0025 -0.0025 3.8959 31.6490 40.5914
frequency: -58.3258 31.5855 40.4507 55.1222 83.5754 128.1356 196.4392 201.4294 222.9885 276.2145 298.9179 369.6952 382.2372 394.1057 457.5393 503.4804 581.7708 611.0755 648.0107 694.5441 853.9069 878.2504 937.0927 946.2115 1015.6394 1041.0480 1052.6752 1121.7542 1130.5711 1194.0733 1260.0023 1287.8077 1328.2176 1374.8443 1384.8412 1407.8050 1445.9138 1450.3994 1470.1284 1480.6255 1637.5933 1748.6499 2995.7809 2997.4916 3042.5484 3052.9071 3088.1132 3098.9834 3110.6923 3125.4110 3127.5917
redmass: 1.0690 7.8020 12.5108 4.8795 3.6351 8.2697 5.6727 1.1998 2.6716 2.3133 3.3657 4.5345 5.5026 10.1302 9.2714 3.3904 4.0626 6.0307 3.3230 4.6276 4.4844 1.6238 1.9909 2.2158 1.5453 3.6385 1.5547 2.4851 1.7039 1.2500 1.1823 1.2694 1.4292 1.2205 1.1718 1.0959 1.0618 1.0485 1.0484 1.0504 8.8095 11.4628 1.0346 1.0358 1.0599 1.0819 1.0973 1.1013 1.1005 1.1069 1.1012
irintensity: 1.4822 0.5696 1.0091 3.0469 4.1207 0.5269 1.0182 0.7879 4.4858 5.6253 2.5117 48.7136 3.2422 3.7470 4.1387 0.5202 74.2199 12.0795 46.3084 13.1237 109.9090 6.6312 122.2707 33.3261 3.9197 2.6755 9.0564 157.8373 2.4705 5.2583 9.3928 4.7122 5.6859 50.5480 10.4520 23.9398 26.8132 22.8706 18.5719 15.4000 149.0949 224.6537 17.5149 0.6322 8.3874 3.2478 4.7659 14.9256 12.6371 0.1878 9.0933
temp: 298.150 k
press: 1.00000 atm
elementType: 17 16 8 8 6 6 6 6 6 6 1 1 1 1 1 1 1 1 1
symmnumber: 1
zpe: 366445.4 jmol-1
zpe.correction: 0.139572 hartree
zpe.thermalcorrener: 0.151424 hartree
zpe.thermalcorrenthalpy: 0.152368 hartree
zpe.thermalcorrgfe: 0.099376 hartree
zpe.sumelectzpe: -1241.834827 hartree
zpe.sumelectthermal: -1241.822975 hartree
zpe.sumelectthermalent: -1241.822030 hartree
zpe.sumelectthermalfe: -1241.875023 hartree
dipole: -2.6138 1.6342 -0.1585
dipole: 3.0867
quadrupole: -72.3503 -72.2439 -79.1202
quadrupole: 11.4001 -1.1576 4.8449
quadrupole: 2.2211 2.3276 -4.5487 11.4001 -1.1576 4.8449
hfenergy: -1241.9743984 hartree
pointgroup: C01 [X(C6H9Cl1O2S1)]
dipole: 0.9903046 -0.692253 0.1219147 debye
dipolederiv: -0.4412183 0.1986582 -0.317498 0.244804 -0.3282179 0.2417597 -0.4296068 0.2733374 -0.7696112 -0.6262674 -0.0078257 0.2365801 0.0598746 -0.115053 -0.0984443 0.4243343 -0.0150061 -0.4130773 -0.366389 0.1830798 0.1014466 0.1177391 -0.3575893 -0.2391981 -0.1988893 -0.0254129 -1.0464642 -0.5181066 -0.1328083 0.0321383 0.1857464 -0.6708884 -0.4937399 0.3518768 -0.2956559 -0.6883779 0.0031053 0.0284291 -0.0156999 -0.0475264 -0.2231483 -0.0662467 0.0053097 0.0017042 -0.1194784 0.3163897 0.1467748 0.0271413 0.2867288 0.0645619 0.000404 0.0979087 -0.0580704 0.1007823 -0.1157199 0.1011247 -0.0529551 0.0454781 0.0793819 -0.0028661 -0.1454748 -0.0381261 0.061866 0.7216205 -0.5730463 0.2322938 -0.540814 0.6667419 0.0177449 0.6627648 -0.2738265 1.7464652 1.1105506 0.2250746 -0.4739426 -0.1481079 0.6115595 0.5836836 -0.9486848 0.347553 0.9081372 -0.3715025 -0.2286625 0.0599087 -0.2197948 -0.1309561 -0.0061603 0.0799972 0.0045476 0.0016572 0.0676521 0.0032067 0.0447637 -0.0100675 0.0536561 0.0430508 0.0248602 0.0544186 0.0162066 0.0089362 -0.0604718 0.0811967 -0.0744552 0.0982208 -0.0075137 0.0079808 0.0218789 -0.0025634 -0.0101706 0.0354557 -0.0242801 -0.0103661 -0.0418055 0.0139635 -0.0523088 -0.0527062 0.0793105 0.0603036 -0.0507791 0.0678176 -0.0303838 0.053106 -0.0002743 0.1120991 0.0695614 -0.066742 -0.0144999 -0.0247655 -0.0896039 -0.0149623 0.1033714 0.0485442 -0.119309 0.0011078 -0.0031204 0.0249317 0.0895883 0.0444926 0.0930158 -0.0573457 -0.029582 0.0436396 -0.0251657 0.1016554 0.0610358 -0.0067437 -0.0352079 0.0099566 0.1283083 0.0353501 -0.0683597 0.0314555 -0.0248264 0.0696767 0.0938421 0.0076832 0.0531975 -0.0225926 0.0159792 0.0312428 0.0049321 0.1208774 0.0196719 -0.0201311 0.0737248 -0.0000629 0.088689 -0.0564545 0.1206193 -0.0265267 -0.0026965 unknown
polarizability: 109.9922337|3.6624211|85.6810553|0.6376392|3.731782|94.6783774 unknown
InChI: InChI=1S/C6H9ClO2S/c1-4(6(7)9)3-10-5(2)8/h4H,3H2,1-2H3
charge 0 multiplicity 1
19 atoms
Cl -2.805618 1.233584 -1.552834
S  1.215193 0.545997 1.089699
O  -2.24292 1.083254 1.125279
O  2.145389 -0.957906 -1.011605
C  -1.043369 -0.589853 -0.269341
C  -0.052536 -0.841032 0.884891
C  -1.902242 -1.861088 -0.546281
C  -1.967066 0.576525 0.046822
C  2.369318 0.039439 -0.291403
C  3.57002 0.955789 -0.413944
H  -0.488986 -0.347545 -1.192608
H  -0.560738 -0.921089 1.858935
H  0.520785 -1.758293 0.674277
H  -2.466662 -2.165444 0.353033
H  -2.615312 -1.678186 -1.366872
H  -1.233164 -2.687477 -0.841483
H  4.204971 0.869532 0.486582
H  3.248818 2.009268 -0.493395
H  4.159919 0.678923 -1.301452
