program: Gaussian 09
title: 000103559
version: EM64L-G09RevD.01
frameworkgroup: C1[X(C20H24O8)]
method: RPBEPBE
basis: SDD
operation: Freq
keyword: #pfreq=noraman
keyword: PBEPBE/SDD
title: #p freq=noraman PBEPBE/SDD
converged: YES YES NO NO
title: Mulliken charges:
elementType: O O O O O O O O C C C C C C C C C C C C C C C C C C C C H H H H H H H H H H H H H H H H H H H H H H H H
charge: -0.184623 -0.199362 -0.289456 -0.265320 -0.241741 -0.236576 -0.239505 -0.261208 -0.287199 -0.470453 -0.445493 -0.490650 0.125457 0.199522 -0.535409 -0.579511 0.457584 0.176337 -0.529329 0.334230 -0.329469 -0.399351 0.275208 0.284038 -0.231686 -0.237305 -0.669830 -0.669291 0.275798 0.251658 0.216389 0.249779 0.228362 0.256939 0.243583 0.297260 0.279599 0.240646 0.258714 0.312113 0.256537 0.268426 0.238081 0.233366 0.233993 0.233436 0.214616 0.233703 0.233771 0.213421 0.235168 0.235033
chargesum: 0.00000
title: Mulliken charges with hydrogens summed into heavy atoms:
elementType: O O O O O O O O C C C C C C C C C C C C C C C C C C C C
charge: -0.184623 -0.199362 -0.289456 -0.265320 -0.241741 -0.236576 -0.239505 -0.261208 -0.011401 -0.002406 0.032648 0.009873 0.125457 0.199522 0.041449 -0.080151 0.457584 0.176337 -0.217216 0.334230 -0.072932 -0.130925 0.275208 0.284038 0.239761 0.230125 0.012259 0.014332
polarizability: 3.30920557e+02 -1.91578608e+01 2.42416738e+02 1.11473827e+01 1.52186655e+01 1.76517256e+02
1716.lowfreq: -11.2354 -5.8643 -3.8051 -0.0003 0.0008 0.0009 5.0254 11.0575 19.0834
frequency: -9.1097 10.6629 19.0731 23.4464 30.2277 30.8381 46.1897 53.5046 57.9441 63.1807 74.4517 75.9105 86.7775 96.0259 124.0100 127.7233 141.7956 147.4768 157.6318 179.9909 183.7076 206.6014 227.8390 248.6338 249.6705 259.3339 284.3229 297.9242 326.4515 335.5040 358.4087 372.1624 383.8485 406.1774 431.3941 461.4681 469.4633 470.9104 542.5679 548.0955 579.7324 581.4619 601.6224 607.9926 658.6542 670.4672 682.5827 684.7204 690.5494 728.6600 737.3021 747.4597 764.1845 802.6331 803.4055 809.8198 816.1539 817.6860 829.8880 834.0371 844.0032 896.8961 901.5465 906.8613 926.0774 952.3894 956.5219 970.0633 980.5678 996.6051 1012.4955 1029.8914 1033.4076 1038.9976 1069.0790 1086.3202 1090.8603 1104.7936 1113.4999 1114.3471 1134.7636 1137.4997 1137.9484 1138.1926 1147.9035 1150.9708 1159.8637 1170.3012 1175.5690 1205.2756 1231.2544 1243.8434 1253.6127 1254.4016 1257.9689 1260.9479 1270.2469 1280.3834 1303.0939 1317.3462 1319.7001 1354.7592 1360.2994 1360.5651 1383.8975 1402.2044 1404.5223 1415.4101 1426.5039 1438.0184 1458.9198 1462.1624 1462.3810 1473.6265 1473.8372 1474.7566 1481.6868 1485.5592 1487.1314 1487.6795 1599.2855 1609.6331 1619.5732 1627.7508 1645.3348 1649.5022 2965.6723 2984.1440 2998.9610 2999.8131 3006.1561 3012.5147 3012.8478 3013.7418 3013.7796 3021.9977 3026.3772 3068.1007 3071.0778 3074.3097 3075.5131 3081.5363 3094.0684 3095.7953 3096.4611 3112.6039 3113.2586 3164.1492 3185.3359 3192.1575
redmass: 5.1230 5.2260 4.1386 3.9317 4.9039 4.6383 4.4219 6.5984 4.6709 4.7928 2.7694 3.9151 4.2355 3.5774 3.3843 3.1986 3.9969 3.6987 4.3731 3.2140 3.0395 4.4248 5.5591 1.2204 1.2562 5.3086 3.9896 2.8627 8.8978 4.3418 4.8340 3.7805 4.5696 4.5253 4.9785 3.0424 3.2219 3.5048 2.5641 4.6228 4.9735 7.0664 3.1479 4.2238 5.8918 4.7027 10.9134 9.6754 5.7467 5.8799 4.5744 3.0015 2.5518 1.0972 1.0977 2.9059 2.2126 1.9724 4.0685 2.1411 2.5004 2.7044 2.6996 2.0296 1.7804 1.7519 2.8468 2.3759 2.6967 2.0426 2.5368 2.8168 1.8644 2.7787 2.5525 2.0006 2.2682 1.8560 2.3508 2.2860 3.4976 2.1761 1.4542 1.4615 1.7122 1.3494 1.5566 6.6178 3.0204 1.4321 1.2683 2.8464 1.1328 1.1326 1.2914 1.4754 1.4792 1.3777 1.4414 1.3732 1.4125 1.6604 1.3636 1.3693 8.7237 1.2664 1.2650 3.8402 1.0794 1.0898 1.0899 1.0396 1.0393 1.2504 1.1200 1.4292 1.0926 1.3168 1.0710 1.0813 7.0090 8.1564 7.7596 10.8499 11.2146 11.8703 1.0610 1.0658 1.0359 1.0361 1.0667 1.0879 1.0581 1.0691 1.0582 1.0623 1.0817 1.0949 1.1017 1.1073 1.1072 1.1003 1.1049 1.0984 1.0984 1.1030 1.1028 1.0892 1.0975 1.0926
irintensity: 0.2086 0.2349 0.8654 0.4483 0.4190 1.2202 0.8902 0.7206 0.8263 0.4465 1.3241 4.3660 1.0180 2.6480 4.5798 5.3818 3.2511 2.1079 0.3351 6.2328 2.0876 4.8145 6.6072 0.7748 0.8738 1.9784 10.3426 8.6393 5.0947 31.9471 0.1444 0.0659 3.9689 15.7325 2.4869 9.2712 6.5401 2.3207 9.7181 9.7016 2.0038 0.1722 1.5263 3.7290 0.8299 1.1263 16.7187 24.4561 6.8765 6.8605 11.9587 5.9802 7.9199 3.9963 3.7078 5.2206 27.6753 26.7769 21.8018 12.1702 56.9393 11.8456 6.2706 10.2812 20.9630 2.8657 7.3999 4.4071 32.4285 63.8763 99.0374 144.4290 65.1139 104.9501 42.7775 158.6004 144.2481 133.5967 148.9118 11.9282 1634.4334 32.4686 5.4964 19.1805 7.7939 14.0152 29.8915 655.9689 102.5325 12.0172 1.2775 19.9355 0.0328 0.0826 29.5830 30.2076 24.8667 20.7460 22.3027 2.3506 5.5684 52.1785 6.2918 7.1757 12.0231 23.4036 21.8179 27.7051 18.2850 34.6378 14.0774 11.6544 12.3575 39.8454 41.1371 51.8029 13.3864 61.2482 15.8170 21.1883 31.4850 28.5481 168.4201 195.7561 193.8456 87.4847 9.8000 10.9762 18.5061 19.3845 32.1012 5.8771 18.7348 5.7607 19.0977 32.4661 5.3098 8.7680 10.8087 7.9839 6.2951 16.3026 28.2681 26.4576 26.3536 40.2991 39.4817 3.5947 1.5257 6.8303
temp: 298.150 k
press: 1.00000 atm
elementType: 8 8 8 8 8 8 8 8 6 6 6 6 6 6 6 6 6 6 6 6 6 6 6 6 6 6 6 6 1 1 1 1 1 1 1 1 1 1 1 1 1 1 1 1 1 1 1 1 1 1 1 1
symmnumber: 1
zpe: 1071627.0 jmol-1
zpe.correction: 0.408161 hartree
zpe.thermalcorrener: 0.436608 hartree
zpe.thermalcorrenthalpy: 0.437552 hartree
zpe.thermalcorrgfe: 0.343523 hartree
zpe.sumelectzpe: -1376.211444 hartree
zpe.sumelectthermal: -1376.182998 hartree
zpe.sumelectthermalent: -1376.182053 hartree
zpe.sumelectthermalfe: -1376.276082 hartree
dipole: 1.8871 0.5793 -0.8611
dipole: 2.1536
quadrupole: -116.4714 -150.0872 -170.7047
quadrupole: -6.6861 -5.5930 4.9768
quadrupole: 29.2830 -4.3328 -24.9502 -6.6861 -5.5930 4.9768
hfenergy: -1376.6196052 hartree
pointgroup: C01 [X(C20H24O8)]
dipole: -0.7503263 0.0938205 0.3822862 debye
polarizability: 323.2117872|31.7556048|251.7040039|6.0821356|-13.4771352|174.9387599 unknown
InChI: InChI=1S/C20H24O8/c1-3-25-19(23)27-14-9-11-18(28-20(24)26-4-2)13(12-14)8-10-17(22)15-6-5-7-16(15)21/h9,11-12,15H,3-8,10H2,1-2H3
charge 0 multiplicity 1
52 atoms
O  -2.107225 3.461692 1.604389
O  -3.290546 0.597647 -1.096824
O  -0.542323 -2.566609 1.023942
O  4.436551 -0.009309 0.354786
O  -2.301881 -3.804643 0.459965
O  6.081719 1.374422 -0.149626
O  -0.579503 -3.565389 -1.120623
O  3.951327 1.897352 -0.975415
C  -3.739739 1.644804 1.072344
C  -5.218682 1.778418 0.648521
C  -5.281042 3.101695 -0.170613
C  -4.282002 4.042443 0.542484
C  -3.218309 3.115319 1.140155
C  -2.87111 0.853335 0.062551
C  -1.502379 0.428647 0.571969
C  -0.564233 -0.099186 -0.540286
C  0.71433 -0.689371 0.028615
C  0.708362 -1.902493 0.757747
C  1.955236 -0.024088 -0.134612
C  3.125306 -0.57649 0.431865
C  1.870668 -2.45191 1.325079
C  3.098633 -1.783573 1.162228
C  -1.091155 -3.342321 -0.006414
C  4.731187 1.165708 -0.327969
C  -3.063363 -4.66026 -0.510232
C  6.619849 2.606365 -0.814887
C  -4.359025 -5.052396 0.188412
C  8.105587 2.658184 -0.481935
H  -3.58265 1.189681 2.068259
H  -5.548654 0.91407 0.049302
H  -5.86031 1.85086 1.546613
H  -4.947992 2.905565 -1.204952
H  -6.30065 3.51999 -0.213754
H  -3.810907 4.805233 -0.101277
H  -4.764149 4.58379 1.382462
H  -1.051108 1.282932 1.11686
H  -1.667558 -0.360168 1.335658
H  -0.317779 0.726138 -1.230855
H  -1.109537 -0.848827 -1.142206
H  2.001398 0.910556 -0.695795
H  1.807916 -3.388407 1.886315
H  4.027192 -2.174499 1.585708
H  -3.235967 -4.06912 -1.427326
H  -2.435798 -5.532536 -0.76674
H  6.064719 3.47902 -0.426419
H  6.42856 2.524062 -1.899941
H  -4.964515 -5.687561 -0.483397
H  -4.95141 -4.159274 0.449431
H  -4.15388 -5.618996 1.112353
H  8.559288 3.550973 -0.949361
H  8.626374 1.763244 -0.862055
H  8.263477 2.71738 0.608101
