program: Gaussian 09
title: 000103512
version: EM64L-G09RevD.01
frameworkgroup: C1[X(C25H28NOP)]
method: RPBEPBE
basis: SDD
operation: Freq
keyword: #p
keyword: freq=noraman
keyword: PBEPBE/SDD
title: #p freq=noraman PBEPBE/SDD
converged: YES YES NO NO
title: Mulliken charges:
elementType: P O N C C C C C C C C C C C C C C C C C C C C C C C C C H H H H H H H H H H H H H H H H H H H H H H H H H H H H
charge: 0.955236 -0.662953 -0.082221 -0.677218 -0.351693 -0.360820 -0.367816 -0.356070 -0.439854 -0.449547 0.567498 -0.078608 -0.079364 -0.447602 -0.372819 -0.311454 -0.255047 -0.255982 -0.294492 -0.222860 -0.247164 -0.209956 -0.236740 -0.246910 -0.213265 -0.244594 -0.225451 -0.226224 0.249091 0.232188 0.250310 0.204745 0.197787 0.222925 0.175498 0.179144 0.225834 0.204892 0.226622 0.224877 0.207223 0.220855 0.280597 0.295067 0.221369 0.219045 0.291588 0.222877 0.225671 0.234246 0.229503 0.231583 0.231855 0.226146 0.232252 0.230194
chargesum: 0.00000
title: Mulliken charges with hydrogens summed into heavy atoms:
elementType: P O N C C C C C C C C C C C C C C C C C C C C C C C C C
charge: 0.955236 -0.662953 -0.082221 -0.428126 0.130805 0.041712 0.030607 0.048909 -0.008340 -0.017446 0.567498 -0.078608 -0.079364 -0.226746 -0.092222 -0.016387 -0.033677 -0.036937 -0.002903 0.000017 -0.021493 0.024290 -0.007237 -0.015326 0.018590 -0.018448 0.006802 0.003970
polarizability: 2.79968082e+02 3.13499138e+01 3.33191453e+02 8.23390927e+00 -7.07714487e+00 2.63789843e+02
1716.lowfreq: -13.1022 -10.6778 -7.9302 -2.8995 -0.0007 -0.0006 0.0009 4.1491 17.3644
frequency: -11.2626 -7.5761 15.4475 25.1999 29.8392 31.3026 34.0533 38.6813 53.3450 60.7226 81.9659 85.7401 121.5489 153.5603 165.1083 179.9711 193.6327 198.1628 214.1413 227.8096 230.2310 235.3022 273.2100 326.4125 371.2346 372.7521 387.2938 394.4405 400.3506 402.9243 449.6576 464.7031 491.1026 534.4794 541.7498 583.8600 599.5152 611.0034 612.6041 617.8156 634.4172 673.1454 693.2917 695.8784 698.6145 702.9214 708.2247 753.6899 756.1723 761.2313 765.8862 785.4168 826.4420 848.5883 849.5169 854.4267 857.2927 862.3830 898.3842 918.0993 927.1096 934.2379 955.6361 961.1235 967.3043 972.3881 983.0568 985.1877 986.6597 988.1694 989.6666 993.0407 1002.7502 1006.1719 1007.6729 1019.8930 1020.3046 1030.6107 1039.7413 1063.6813 1072.5504 1074.0227 1081.4574 1084.3800 1088.4418 1091.0083 1092.1319 1117.8468 1141.6150 1171.0951 1172.8420 1173.5373 1175.2461 1184.5656 1186.7090 1189.7231 1191.8468 1196.5800 1200.6484 1210.0574 1227.0359 1238.9274 1272.9159 1286.2310 1288.8679 1298.5346 1305.6892 1307.0865 1311.8507 1327.2857 1337.1702 1346.4627 1377.1227 1379.7169 1380.1499 1382.4318 1423.6830 1426.5215 1441.4401 1461.9150 1464.1183 1464.2575 1466.2131 1475.4669 1478.2693 1480.6099 1482.1175 1495.3436 1585.9297 1589.1467 1590.2436 1595.2358 1596.9080 1611.6872 2829.3434 2839.8307 2855.8516 2991.9461 2994.0359 3000.7801 3010.0086 3021.7692 3032.1854 3046.9469 3062.8578 3066.0252 3091.2844 3111.4543 3117.1348 3122.5441 3123.8585 3128.6681 3129.8508 3135.7675 3138.1188 3139.2118 3146.4638 3149.4595 3150.0383 3161.6949 3164.2811 3164.9945
redmass: 3.3768 3.7314 3.7985 3.0594 2.5061 3.1297 4.0294 4.3508 4.6016 4.2331 3.4943 4.7911 4.0759 3.6788 5.5965 4.8198 3.0653 3.0810 5.4976 4.4987 3.5116 4.9105 6.9559 2.1861 5.0519 4.3606 4.8236 2.7670 2.8652 2.8006 5.1457 4.0795 4.6251 4.5099 3.7741 4.4858 3.4592 6.4463 6.3403 5.2120 2.9384 6.0874 6.2347 3.7123 1.7366 1.6528 1.7971 1.5630 1.7226 1.9145 1.8429 2.0197 1.7292 1.2633 1.5175 1.2587 2.7855 1.2456 2.6316 1.5372 1.3856 1.3817 5.9823 2.4458 1.5808 1.4576 1.3962 1.8259 2.9897 3.5235 5.7195 1.4856 2.4589 1.3817 1.3285 2.9700 2.9830 1.9625 2.7720 2.4704 1.9996 1.6521 1.7790 2.4676 2.5914 1.7506 1.8746 2.3081 2.1065 1.0591 1.0562 1.0966 1.2590 1.1460 1.1699 1.2952 1.1221 1.2476 1.8371 1.5292 1.8044 1.2375 1.2677 1.2764 1.3448 1.3135 1.3142 1.2915 1.3178 1.4150 1.2917 1.4228 8.3474 4.8127 1.7272 6.4007 2.1005 2.1197 2.1824 1.0814 1.0837 2.0507 2.0469 1.0856 1.0807 1.1089 2.1950 1.1036 6.0687 6.1188 5.9643 5.8611 5.8565 6.0224 1.0712 1.0720 1.0687 1.0872 1.0793 1.0636 1.0599 1.0688 1.0822 1.0886 1.1026 1.1043 1.1054 1.0873 1.0870 1.0851 1.0862 1.0868 1.0875 1.0916 1.0915 1.0920 1.0960 1.0961 1.0963 1.1015 1.1015 1.1015
irintensity: 0.2486 0.1182 0.4986 0.1224 0.0970 0.0798 0.1269 0.1076 0.5373 0.4245 0.5422 0.3756 2.3028 1.8357 5.7749 1.4459 2.7204 8.7937 5.0661 4.1878 0.2316 2.7624 4.4000 5.3616 6.4501 2.5345 13.7348 0.4455 0.0803 0.0291 19.5596 2.1225 52.5519 128.5312 20.6043 23.1108 7.9509 0.1150 0.2797 0.6084 0.1838 11.1760 16.1652 3.7721 55.3152 59.8840 74.2568 11.7611 13.1946 23.3128 29.2304 16.4485 4.5045 1.2775 2.5018 0.5359 15.9961 0.3995 6.7603 5.9987 0.8340 0.8196 39.2669 1.9599 4.4507 0.3894 0.1594 0.9433 1.5235 0.3698 3.1347 0.4799 12.1118 1.1425 0.2288 2.3895 3.0679 4.4807 7.4113 7.5330 8.0084 9.9504 10.2705 31.4481 21.2768 8.3560 10.9072 28.6150 48.5758 0.2379 0.1640 0.0886 0.6118 7.4855 4.2122 3.5539 0.3023 2.2457 0.9326 2.8002 11.9770 6.5702 1.3487 4.5893 4.4764 2.4367 1.6682 1.7720 7.8022 11.8845 2.8699 8.6802 1.0454 4.2956 8.6215 0.2650 3.5802 31.3959 8.6680 3.1334 3.2743 13.1246 5.1862 5.9608 2.9385 6.0252 24.7961 5.2742 0.0936 0.2879 2.1424 1.2162 0.7283 8.7210 58.8627 51.4291 158.3185 15.8272 10.6169 17.9101 18.6900 70.7688 68.7792 18.0378 23.2673 3.3689 70.8915 8.6504 9.8407 1.1428 0.4670 3.0878 4.0688 17.8949 4.4520 9.1425 19.5521 6.9602 37.2294 31.2500 48.3463 28.0814
temp: 298.150 k
press: 1.00000 atm
elementType: 15 8 7 6 6 6 6 6 6 6 6 6 6 6 6 6 6 6 6 6 6 6 6 6 6 6 6 6 1 1 1 1 1 1 1 1 1 1 1 1 1 1 1 1 1 1 1 1 1 1 1 1 1 1 1 1
symmnumber: 1
zpe: 1215457.3 jmol-1
zpe.correction: 0.462943 hartree
zpe.thermalcorrener: 0.487904 hartree
zpe.thermalcorrenthalpy: 0.488848 hartree
zpe.thermalcorrgfe: 0.404296 hartree
zpe.sumelectzpe: -1438.609276 hartree
zpe.sumelectthermal: -1438.584315 hartree
zpe.sumelectthermalent: -1438.583371 hartree
zpe.sumelectthermalfe: -1438.667923 hartree
dipole: -0.2988 0.0849 -3.8409
dipole: 3.8534
quadrupole: -163.7868 -157.3806 -168.5038
quadrupole: 1.9099 6.0105 -3.6323
quadrupole: -0.5630 5.8431 -5.2801 1.9099 6.0105 -3.6323
hfenergy: -1439.0722191 hartree
pointgroup: C01 [X(C25H28N1O1P1)]
dipole: 0.132448 0.0141714 1.5101928 debye
polarizability: 274.8661288|-25.9980227|338.3625313|8.6097373|6.9244237|263.7207174 unknown
InChI: InChI=1S/C25H28NOP/c27-28(23-14-6-2-7-15-23,24-16-8-3-9-17-24)25(22-12-4-1-5-13-22)18-21-26-19-10-11-20-26/h1-9,12-17,25H,10-11,18-21H2
charge 0 multiplicity 1
56 atoms
P  1.117516 0.494703 -0.699236
O  0.909287 0.345234 -2.30144
N  -4.072695 0.509781 0.399778
C  -0.28888 -0.328434 0.3233
C  -1.633674 0.305846 -0.118932
C  -2.82197 -0.207411 0.721568
C  -5.20312 0.183276 1.30875
C  -4.607991 0.26885 -0.967462
C  -6.433445 0.813793 0.608339
C  -6.045725 0.849942 -0.910209
C  -0.228496 -1.840277 0.166148
C  1.141532 2.298238 -0.18394
C  2.725238 -0.298688 -0.155298
C  -0.009328 -2.671534 1.293346
C  -0.402122 -2.445064 -1.108591
C  1.240508 3.244844 -1.230627
C  3.254677 -0.177162 1.150146
C  1.059762 2.727447 1.161821
C  3.408891 -1.049221 -1.139501
C  0.022989 -4.077935 1.16022
C  -0.367451 -3.849876 -1.241661
C  1.27036 4.624494 -0.927414
C  4.472197 -0.818069 1.47322
C  1.088187 4.108534 1.460653
C  4.625727 -1.68818 -0.81214
C  -0.159595 -4.672495 -0.109171
C  1.197627 5.057279 0.417232
C  5.157206 -1.574681 0.49347
H  -0.082737 -0.062092 1.379034
H  -1.58947 1.406763 -0.014983
H  -1.794352 0.088458 -1.1912
H  -2.932761 -1.313397 0.579566
H  -2.604138 -0.038837 1.795736
H  -5.019146 0.592214 2.318824
H  -5.343488 -0.925102 1.408078
H  -4.639041 -0.8275 -1.202159
H  -3.981538 0.759362 -1.731898
H  -7.34909 0.22624 0.796199
H  -6.60654 1.837184 0.982548
H  -6.057562 1.887804 -1.284113
H  -6.738977 0.260567 -1.535469
H  0.133592 -2.215105 2.281171
H  -0.533714 -1.808849 -1.991268
H  1.279825 2.883138 -2.26489
H  2.741193 0.416725 1.915113
H  0.956194 2.00516 1.980674
H  2.97589 -1.113426 -2.144694
H  0.189958 -4.706329 2.042522
H  -0.496872 -4.3043 -2.230647
H  1.346621 5.358769 -1.736862
H  4.88661 -0.724592 2.483205
H  1.020885 4.442881 2.501778
H  5.156561 -2.271758 -1.572296
H  -0.135738 -5.762976 -0.21548
H  1.219268 6.127623 0.651107
H  6.101455 -2.06996 0.746733
