program: Gaussian 09
title: 000103475
version: EM64L-G09RevD.01
frameworkgroup: C1[X(C20H22N2O)]
method: RPBEPBE
basis: SDD
operation: Freq
keyword: #p
keyword: freq=noraman
keyword: PBEPBE/SDD
title: #p freq=noraman PBEPBE/SDD
converged: YES YES NO NO
title: Mulliken charges:
elementType: O N N C C C C C C C C C C C C C C C C C C C C H H H H H H H H H H H H H H H H H H H H H H
charge: -0.229664 -0.091823 -0.061006 -0.047260 -0.386189 0.432977 0.312777 0.306170 -0.716325 -0.712651 -0.715454 -0.437321 -0.430374 -0.484211 -0.246553 -0.241512 0.022208 0.227286 -0.258675 -0.338127 -0.232563 -0.235188 -0.539461 0.247754 0.219405 0.233245 0.211420 0.228803 0.224497 0.215834 0.211893 0.254837 0.216385 0.239500 0.242450 0.249055 0.223671 0.224145 0.270182 0.243426 0.228239 0.225916 0.221399 0.221096 0.249789
chargesum: 0.00000
title: Mulliken charges with hydrogens summed into heavy atoms:
elementType: O N N C C C C C C C C C C C C C C C C C C C C
charge: -0.229664 -0.091823 -0.061006 -0.047260 -0.138435 0.432977 0.312777 0.306170 -0.052255 -0.043517 -0.032339 -0.197822 -0.187924 -0.235157 -0.022882 -0.017367 0.022208 0.227286 0.011507 -0.094702 -0.004324 -0.009272 0.152823
polarizability: 4.68462230e+02 -1.67958783e+01 2.50817048e+02 3.50160089e-01 3.55832917e+00 1.25753242e+02
1716.lowfreq: -7.8764 -0.0010 -0.0004 0.0001 1.3066 3.5583 14.1963 23.6400 39.2014
frequency: 14.0940 23.1261 39.1817 49.5421 90.5646 100.7773 108.7036 114.6574 142.0022 167.2324 179.9639 204.4841 221.5271 222.8753 231.7678 246.6753 254.0982 260.6327 275.9445 278.1676 307.9044 323.3542 337.0261 349.5590 383.6009 416.7507 462.4636 482.7874 492.7155 517.3505 547.3929 549.0433 554.7676 563.5646 592.3125 616.4896 644.0344 667.0741 714.5685 746.8225 756.5757 758.6594 760.1689 768.1553 789.4239 808.5506 855.9089 868.0598 877.2763 905.1451 921.4985 931.5721 945.7806 950.1165 971.3953 978.6272 983.9169 984.7868 1001.7206 1022.1151 1024.5877 1038.3937 1053.6847 1076.5628 1086.9980 1108.8408 1110.0660 1119.1013 1133.3559 1148.0238 1162.4369 1170.5010 1171.5228 1187.1183 1198.0655 1206.8646 1223.8030 1240.3823 1259.2630 1266.0394 1275.0090 1287.7033 1316.6408 1340.9439 1371.6362 1376.1049 1385.5909 1387.3453 1392.9122 1425.6243 1439.6698 1444.6058 1459.4724 1460.6239 1465.5822 1467.9376 1470.1247 1471.5497 1475.9130 1478.4714 1480.8966 1483.2429 1580.6982 1592.1155 1593.9939 1617.1875 1639.9630 2960.7171 2976.0132 2979.9471 2981.2032 2985.6639 3050.3769 3060.8612 3071.8481 3077.0035 3077.8864 3084.0068 3089.5071 3100.4030 3115.3285 3121.4442 3128.3468 3131.3220 3136.8761 3147.9815 3157.7515 3163.7532 3172.7895
redmass: 4.1662 4.0295 4.6693 4.1340 3.4003 3.5414 3.5142 4.6769 3.2967 4.5240 2.9173 1.7952 2.8408 1.5930 1.4463 1.5042 1.1038 2.1539 2.3424 2.5862 3.0022 3.6090 4.6615 3.3562 3.6081 4.8381 4.8074 4.1566 3.2714 4.1711 3.8514 4.1569 3.5970 4.8053 4.7616 4.4748 4.9924 3.8242 4.1403 3.6856 3.3227 1.9960 1.4478 1.8549 2.9377 3.3507 1.5101 3.4730 1.4200 2.6404 1.5335 1.4687 1.3934 1.3634 1.9640 8.2206 1.3409 1.3236 1.3330 2.2950 2.0802 2.0296 2.3001 1.9607 2.7081 1.9919 1.2598 1.7616 3.7741 1.4757 1.6671 1.0856 1.4421 1.6100 2.0308 2.6289 3.0614 2.6083 1.4849 1.7657 2.2786 1.6369 2.7890 3.0180 1.1866 1.2031 10.6927 6.9463 1.2034 1.6978 1.4913 2.2431 1.0507 1.0521 1.4270 1.3013 1.0530 1.3917 1.1549 1.4538 1.0590 1.2315 7.2926 6.2296 6.6231 6.8911 8.2334 1.0329 1.0341 1.0348 1.0346 1.0824 1.1040 1.0901 1.1000 1.0996 1.0997 1.1009 1.1003 1.1007 1.0857 1.0891 1.0989 1.0858 1.0938 1.0899 1.1001 1.0938 1.0984
irintensity: 0.0464 0.0469 0.9806 2.6517 0.2238 5.6192 0.8093 1.6819 2.1456 1.2496 0.0645 0.0678 0.4022 0.3042 0.0961 0.3566 0.1305 1.7418 1.2783 0.9731 3.5769 0.7299 11.5150 1.7193 2.1272 2.7763 5.4116 6.9034 4.2257 8.8726 1.6704 2.8108 0.1432 9.3639 0.6920 6.5715 4.2832 8.8790 4.2596 2.0146 28.7133 62.9048 54.3514 42.3401 2.4540 6.1085 0.3601 1.2920 0.2103 3.3270 15.3965 3.1826 1.2999 2.2374 25.8919 43.4331 0.9337 0.1474 0.3583 19.1851 7.8043 10.7616 0.5652 15.6527 24.0129 31.4260 0.1685 8.4402 4.8154 3.6928 47.3186 0.1069 24.8319 9.5896 4.6258 64.3494 199.7867 10.5717 33.5428 43.6162 15.2124 2.5114 2.0128 5.4958 8.1179 21.5884 57.1655 13.5122 10.3934 20.4716 3.0434 5.5512 4.0467 2.6821 132.6933 5.9167 13.5534 15.7752 12.5030 10.8038 5.8509 21.0576 32.8336 28.2040 19.9381 0.9159 99.2981 103.1874 27.3206 40.6463 29.2060 6.6487 46.3325 46.2346 1.0465 46.2494 62.6513 19.5594 34.8520 23.1987 7.7887 2.5499 18.6632 0.8242 31.4770 12.4339 47.6610 15.7760 36.0471
temp: 298.150 k
press: 1.00000 atm
elementType: 8 7 7 6 6 6 6 6 6 6 6 6 6 6 6 6 6 6 6 6 6 6 6 1 1 1 1 1 1 1 1 1 1 1 1 1 1 1 1 1 1 1 1 1 1
symmnumber: 1
zpe: 964628.3 jmol-1
zpe.correction: 0.367408 hartree
zpe.thermalcorrener: 0.389371 hartree
zpe.thermalcorrenthalpy: 0.390316 hartree
zpe.thermalcorrgfe: 0.315298 hartree
zpe.sumelectzpe: -958.332823 hartree
zpe.sumelectthermal: -958.310859 hartree
zpe.sumelectthermalent: -958.309915 hartree
zpe.sumelectthermalfe: -958.384933 hartree
dipole: 1.6091 0.1709 0.1528
dipole: 1.6253
quadrupole: -100.4207 -122.7435 -141.9038
quadrupole: 1.2819 0.7384 1.0455
quadrupole: 21.2686 -1.0541 -20.2145 1.2819 0.7384 1.0455
hfenergy: -958.7002308 hartree
pointgroup: C01 [X(C20H22N2O1)]
dipole: -0.6304911 -0.1028921 -0.0279933 debye
polarizability: 466.2950391|-10.7120976|244.6366243|32.4744652|24.1851302|134.1008565 unknown
InChI: InChI=1S/C20H22N2O/c1-14-15-9-5-6-10-16(15)20(2,3)17(14)13-21-22-18-11-7-8-12-19(18)23-4/h5-14H,1-4H3
charge 0 multiplicity 1
45 atoms
O  -4.480803 -1.751068 -0.88295
N  -0.932492 0.028729 -0.220804
N  -2.06079 -0.583344 -0.526567
C  2.711654 -1.222072 -0.121584
C  1.759356 1.060938 0.464264
C  1.436968 -0.36001 -0.00993
C  3.817185 -0.188867 0.129842
C  3.283954 1.085499 0.44138
C  2.849417 -1.877792 -1.526154
C  2.728026 -2.334409 0.974639
C  1.174845 1.379563 1.873918
C  5.212433 -0.388447 0.08445
C  4.140589 2.173539 0.707834
C  0.182962 -0.824165 -0.310288
C  6.075032 0.702299 0.349086
C  5.541615 1.977902 0.658186
C  -3.21066 0.259528 -0.487343
C  -4.486273 -0.370152 -0.695066
C  -3.167452 1.667753 -0.282805
C  -5.667837 0.416706 -0.691971
C  -4.340987 2.440885 -0.281903
C  -5.592301 1.81037 -0.486726
C  -5.769225 -2.414792 -1.105652
H  1.326156 1.797577 -0.241188
H  2.025897 -2.590862 -1.711694
H  2.833381 -1.114095 -2.323143
H  3.803034 -2.433089 -1.597797
H  2.63443 -1.899242 1.985186
H  1.893357 -3.042561 0.822477
H  3.677004 -2.900661 0.929738
H  1.474121 2.39472 2.193908
H  0.074087 1.323301 1.839169
H  1.546468 0.660398 2.625856
H  5.632151 -1.372873 -0.156036
H  3.730606 3.161727 0.948474
H  0.005453 -1.860742 -0.637914
H  7.161353 0.561486 0.313588
H  6.218868 2.816167 0.857835
H  -2.182777 2.122007 -0.133648
H  -6.644662 -0.049583 -0.84803
H  -4.289367 3.523889 -0.128428
H  -6.513352 2.404139 -0.489893
H  -6.267327 -2.034841 -2.018732
H  -6.442401 -2.292654 -0.234927
H  -5.518196 -3.477501 -1.234457
