program: Gaussian 09
title: 000103461
version: EM64L-G09RevD.01
frameworkgroup: C1[X(C15H22O)]
method: RPBEPBE
basis: SDD
operation: Freq
keyword: #pfreq=noraman
keyword: PBEPBE/SDD
title: #p freq=noraman PBEPBE/SDD
converged: NO YES NO NO
title: Mulliken charges:
elementType: O C C C C C C C C C C C C C C C H H H H H H H H H H H H H H H H H H H H H H
charge: -0.428331 0.207918 -0.487385 -0.467614 -0.402677 -0.392964 -0.396618 0.389977 -0.750800 0.309931 -0.600559 0.302864 -0.568248 -0.871591 0.110381 -0.863885 0.195172 0.201850 0.183567 0.229897 0.226010 0.186131 0.185482 0.211580 0.184635 0.199542 0.207689 0.214866 0.221578 0.243697 0.248170 0.224052 0.238444 0.235830 0.229709 0.247887 0.230918 0.362895
chargesum: 0.00000
title: Mulliken charges with hydrogens summed into heavy atoms:
elementType: O C C C C C C C C C C C C C C C
charge: -0.065436 0.207918 -0.090364 -0.054150 0.009464 0.004098 -0.012441 0.389977 -0.106667 0.309931 -0.356862 0.302864 -0.320077 -0.173266 0.110381 -0.155371
polarizability: 1.95768311e+02 8.20460815e+00 1.67029163e+02 8.32737740e+00 -6.65724888e+00 1.22664975e+02
1716.lowfreq: -22.3426 -5.8704 -4.3594 -0.0008 -0.0006 0.0004 37.4417 57.7369 109.7771
frequency: 35.3913 57.7025 109.7692 135.1289 144.5887 175.5110 217.9890 219.8192 223.0370 239.7298 255.8196 269.9514 287.6259 291.3082 305.3217 330.1468 370.3111 375.8571 405.2130 440.2928 443.4758 461.2903 482.3469 510.4177 542.2268 574.8876 618.1547 635.7269 714.8584 738.3889 765.3010 778.6644 797.1810 849.0761 862.1574 870.7347 873.3987 893.8374 923.6289 953.3508 974.6112 983.8036 1010.8365 1016.8170 1035.6570 1038.0447 1042.6526 1053.5746 1087.4215 1095.6699 1100.5584 1131.6020 1142.7168 1152.9412 1186.9437 1203.8737 1216.6646 1258.3192 1265.9177 1272.7588 1286.5590 1303.0094 1318.5391 1336.4287 1340.7124 1342.9600 1350.0539 1363.2310 1381.4658 1390.3530 1399.3927 1408.8142 1457.0002 1460.4512 1463.4534 1468.6434 1471.3293 1473.6766 1475.9429 1478.6530 1482.8200 1490.2673 1493.6096 1506.9729 1576.2235 1636.9223 2950.3937 2959.6082 2961.5020 2967.4899 2971.5843 2973.5788 2981.0959 2981.4226 3016.8138 3016.9365 3022.6357 3030.7420 3044.1714 3061.5567 3062.7411 3078.1905 3081.6824 3084.7173 3094.7947 3144.8815 3154.1634 3582.6048
redmass: 3.2344 4.2190 2.9677 1.1110 2.3377 3.0844 1.5583 1.6219 2.8310 1.1728 1.7804 2.3602 2.2589 1.9625 2.1597 2.5693 3.3871 2.3127 2.8608 3.1350 3.0598 3.5733 2.6621 2.8360 2.1455 2.4574 4.4160 4.2266 5.3233 3.2529 3.3637 1.5148 2.5924 2.2178 1.7679 1.9779 1.4345 1.4054 1.3963 2.2425 1.6315 1.6203 1.6739 1.4858 1.8656 1.6933 1.5095 2.3207 1.3032 2.8123 1.5435 1.8801 2.3408 1.3969 2.2927 2.0010 2.1883 1.3276 1.3620 1.7104 1.3760 2.7408 1.3637 1.3959 1.4073 1.4227 1.4892 4.7319 1.2803 1.5287 1.2180 2.0596 1.0953 1.0939 1.0893 1.0727 1.0847 1.0661 1.0470 1.1983 1.0750 1.0774 1.4964 1.5765 6.1256 6.6971 1.0398 1.0665 1.0664 1.0536 1.0448 1.0610 1.0629 1.0390 1.0982 1.0979 1.0958 1.1027 1.1023 1.0973 1.0966 1.0985 1.0945 1.0968 1.0886 1.0910 1.0890 1.0654
irintensity: 0.3534 0.0118 0.2178 0.0053 0.3654 0.6700 0.2896 0.4759 4.9361 1.8747 32.5675 1.2298 15.2435 46.3987 31.8107 2.0258 2.5022 1.1322 2.9336 1.1424 3.0694 1.0300 5.6878 1.7714 1.3783 5.7262 2.0528 0.1457 0.4875 0.2404 6.2305 0.4169 19.6052 6.8860 2.4393 1.2093 11.7373 11.3589 7.0872 13.7305 3.4169 9.0053 26.2115 1.1687 21.4154 7.0417 11.8538 7.8653 0.6983 15.7767 0.2412 1.8454 1.2632 149.0177 21.0445 55.8758 6.2116 0.1861 1.2528 4.0564 0.5483 12.9233 0.0693 1.5132 3.5449 2.1426 3.0434 6.2147 10.5400 10.7014 11.4072 3.2236 7.6290 4.0501 2.9594 9.7609 8.1009 12.1062 13.8053 3.2967 25.2209 38.9984 53.5192 33.8596 46.9822 10.9613 51.3658 8.7826 48.8767 5.5059 82.1503 42.4864 41.0038 28.3079 33.7108 47.1878 64.6168 27.1156 110.1481 29.2344 59.0780 38.7807 13.4985 28.2014 20.8987 14.5250 8.6308 33.7973
temp: 298.150 k
press: 1.00000 atm
elementType: 8 6 6 6 6 6 6 6 6 6 6 6 6 6 6 6 1 1 1 1 1 1 1 1 1 1 1 1 1 1 1 1 1 1 1 1 1 1
symmnumber: 1
zpe: 872267.8 jmol-1
zpe.correction: 0.332229 hartree
zpe.thermalcorrener: 0.348503 hartree
zpe.thermalcorrenthalpy: 0.349447 hartree
zpe.thermalcorrgfe: 0.290032 hartree
zpe.sumelectzpe: -658.789908 hartree
zpe.sumelectthermal: -658.773634 hartree
zpe.sumelectthermalent: -658.772690 hartree
zpe.sumelectthermalfe: -658.832106 hartree
dipole: 0.4756 -1.6063 0.4641
dipole: 1.7383
quadrupole: -95.6618 -92.5348 -101.3998
quadrupole: 9.0720 -0.7029 -0.9677
quadrupole: 0.8703 3.9973 -4.8677 9.0720 -0.7029 -0.9677
hfenergy: -659.1221377 hartree
pointgroup: C01 [X(C15H22O1)]
dipole: -0.2212883 0.5836088 0.2795903 debye
polarizability: 195.042715|10.713849|164.670081|-6.1561914|13.3489049|125.7496527 unknown
InChI: InChI=1S/C15H22O/c1-11-10-14(16)12(2)9-13(11)15(3)7-5-4-6-8-15/h9-10,16H,4-8H2,1-3H3
charge 0 multiplicity 1
38 atoms
O  4.16076 0.076611 -0.591592
C  -1.505858 -0.42508 0.718321
C  -2.144073 0.962839 1.072045
C  -2.446451 -1.028824 -0.379297
C  -2.310589 1.913187 -0.139825
C  -2.563167 -0.134773 -1.635176
C  -3.140205 1.252202 -1.266279
C  -0.007817 -0.316017 0.288472
C  -1.573507 -1.305287 2.003966
C  0.741624 -1.381382 -0.32404
C  0.713631 0.866659 0.608638
C  2.088602 1.067266 0.351825
C  2.119848 -1.189574 -0.592922
C  0.185741 -2.74508 -0.724552
C  2.787564 0.005926 -0.273319
C  2.794498 2.359913 0.724308
H  -1.58636 1.460997 1.888787
H  -3.150866 0.749881 1.488444
H  -3.454296 -1.126386 0.078392
H  -2.142052 -2.048177 -0.659617
H  -1.317798 2.190862 -0.542557
H  -2.797545 2.85252 0.189489
H  -3.208416 -0.626928 -2.389249
H  -1.562758 -0.010936 -2.096822
H  -4.189341 1.127039 -0.925391
H  -3.167785 1.910803 -2.156244
H  -2.622106 -1.417929 2.341457
H  -1.160376 -2.315938 1.838715
H  -0.995502 -0.838573 2.823081
H  0.187665 1.692273 1.095591
H  2.702493 -1.991008 -1.059575
H  -0.448487 -3.198759 0.055493
H  -0.418499 -2.685623 -1.649311
H  1.016179 -3.444041 -0.92422
H  3.21921 2.877565 -0.160333
H  2.091261 3.064361 1.198774
H  3.620455 2.194693 1.446226
H  4.534321 0.952817 -0.324504
