program: Gaussian 09
title: 000103465
version: EM64L-G09RevD.01
frameworkgroup: C1[X(C14H10N3O3S2)]
method: RPBEPBE
basis: SDD
operation: Freq
keyword: #p
keyword: freq=noraman
keyword: PBEPBE/SDD
title: #p freq=noraman PBEPBE/SDD
converged: YES YES NO NO
title: Mulliken charges:
elementType: S S O O O N N N C C C C C C C C C C C C C C H H H H H H H H H H
charge: 0.950366 0.415771 -0.588432 -0.458824 -0.460828 -0.009728 -0.006943 0.135217 -0.182751 -0.338793 0.485086 0.322287 -0.368141 -0.365102 -0.332843 0.555321 -0.791085 -0.326134 -0.315838 -0.341324 -0.347888 0.413446 0.271846 0.286452 0.248194 0.275816 0.296692 0.317194 0.274355 0.289164 0.288453 0.408993
chargesum: 1.00000
title: Mulliken charges with hydrogens summed into heavy atoms:
elementType: S S O O O N N N C C C C C C C C C C C C C C
charge: 0.950366 0.415771 -0.179438 -0.458824 -0.460828 -0.009728 -0.006943 0.135217 -0.182751 -0.338793 0.485086 0.322287 -0.368141 -0.093256 -0.046392 0.555321 0.029618 -0.008940 -0.041482 -0.052160 -0.059435 0.413446
polarizability: 6.91921269e+02 6.22548452e+01 2.26090868e+02 -7.89547742e-01 -3.94725186e-01 1.01619764e+02
1716.lowfreq: -6.9409 -2.3040 -0.0027 -0.0017 -0.0015 2.5994 16.5401 35.8096 44.2162
frequency: 16.5030 35.8071 44.1875 58.0892 80.3051 87.7593 115.8476 138.1754 146.6598 162.7839 172.5390 177.4003 185.7604 217.4386 232.7496 241.3689 271.8930 291.1700 319.5298 328.9311 346.3950 364.7029 394.1504 400.3737 446.4170 450.4102 462.0894 510.7570 516.6945 528.8627 543.6170 551.6439 559.4075 574.0914 618.6262 624.1817 664.6136 706.5034 723.8067 729.3708 757.5586 808.9486 821.2914 840.6978 841.0154 859.4814 876.1154 928.3225 971.9728 978.7696 985.3547 988.4223 1003.9289 1009.0915 1040.7417 1042.9729 1062.0882 1130.2596 1140.5977 1170.8995 1208.0787 1219.9179 1245.1283 1307.9189 1314.7754 1341.4371 1362.8444 1387.8227 1400.8247 1405.9834 1430.6470 1453.0092 1466.2923 1476.6782 1488.8345 1510.5483 1530.5288 1590.8970 1607.5949 2068.7337 2985.6249 3061.8431 3115.0909 3158.1904 3164.7713 3169.2248 3181.3286 3186.7374 3187.0111 3505.1577
redmass: 11.3893 8.6136 4.1119 9.3459 5.9676 6.4481 1.2592 9.3268 1.8818 2.3903 3.8743 7.3569 7.2645 6.7456 5.8448 9.2947 4.9822 4.5206 7.7363 8.4458 4.8554 7.1213 2.9315 11.0340 5.7136 6.6655 7.6399 4.9217 5.5334 7.4569 8.1591 12.1834 6.9097 4.3632 8.0804 5.0923 8.7889 7.7103 3.5682 4.5263 6.9409 6.8284 1.2738 1.8347 4.0061 1.6085 7.7268 7.4376 13.1777 1.3630 1.3823 2.9299 1.3433 1.5515 1.5742 1.1880 4.3508 1.4523 1.3908 2.1858 2.8561 1.9484 2.4724 2.0518 1.8911 3.0209 3.5944 3.5183 1.3555 3.9314 3.2797 1.0933 4.9597 1.1568 4.0545 5.4772 5.0338 6.6335 6.8109 13.8423 1.0391 1.0963 1.0984 1.0900 1.0897 1.0897 1.0980 1.0992 1.0981 1.0667
irintensity: 0.3259 0.7320 0.4859 0.4626 1.5976 0.4032 2.3145 4.7426 37.7446 26.1762 30.0213 2.9578 10.2950 8.8022 0.3595 1.1752 32.9634 1.3581 7.2701 18.5162 11.7209 2.0649 0.0155 101.8819 1.4909 16.7322 0.9698 1.2761 9.8500 20.3331 0.6001 59.6627 2.9332 9.2996 1.0856 1.0018 1.7013 7.9650 4.4579 2.6369 3.1543 12.8219 2.5187 39.7318 79.0372 85.2515 11.3953 35.7969 77.8364 0.0108 7.7417 4.3505 0.5099 20.7051 23.5003 71.0129 3.2361 46.4443 67.2006 266.0111 7.8203 37.1213 33.0870 3.1088 0.6274 206.7590 10.3203 45.7417 10.6222 139.4618 414.9214 28.7809 43.4386 24.0063 247.8282 25.6217 154.5550 884.3017 129.9141 1692.1220 21.4216 5.0319 28.7522 0.0088 2.4992 2.5947 3.2392 1.4083 3.5398 69.2735
temp: 298.150 k
press: 1.00000 atm
elementType: 16 16 8 8 8 7 7 7 6 6 6 6 6 6 6 6 6 6 6 6 6 6 1 1 1 1 1 1 1 1 1 1
symmnumber: 1
zpe: 561249.7 jmol-1
zpe.correction: 0.213769 hartree
zpe.thermalcorrener: 0.234521 hartree
zpe.thermalcorrenthalpy: 0.235465 hartree
zpe.thermalcorrgfe: 0.162741 hartree
zpe.sumelectzpe: -1723.532132 hartree
zpe.sumelectthermal: -1723.511380 hartree
zpe.sumelectthermalent: -1723.510436 hartree
zpe.sumelectthermalfe: -1723.583159 hartree
dipole: -15.0415 2.0845 -0.2452
dipole: 15.1872
quadrupole: -23.6632 -106.0913 -147.8609
quadrupole: 20.9658 -0.9951 1.2818
quadrupole: 68.8753 -13.5529 -55.3224 20.9658 -0.9951 1.2818
hfenergy: -1723.7459007 hartree
pointgroup: C01 [X(C14H10N3O3S2)]
dipole: -5.8528799 -1.1949826 0.1334323 debye
polarizability: 697.9646587|-31.2322762|219.3910934|7.3679267|-8.5023374|102.2761484 unknown
InChI: InChI=1S/C14H10N3O3S2/c1-8-2-7-11-12(13(8)22(18,19)20)21-14(16-11)9-3-5-10(17-15)6-4-9/h2-7,18H,1H3
charge 1 multiplicity 1
32 atoms
S  3.952396 1.774176 -0.149223
S  0.330114 1.115395 -0.079446
O  2.40875 2.775391 0.069515
O  4.923516 2.018646 1.114178
O  4.521905 1.982956 -1.64315
N  -0.236992 -1.525647 0.088975
N  -6.434233 0.178208 -0.106876
N  -7.595369 0.270319 -0.12864
C  3.075915 0.08551 -0.001777
C  1.68042 -0.077533 0.007446
C  3.966068 -1.021372 0.062156
C  1.143191 -1.425599 0.094718
C  -0.82692 -0.330648 -0.001132
C  3.394558 -2.333427 0.156792
C  2.015582 -2.543481 0.173395
C  -2.266742 -0.167069 -0.028463
C  5.471164 -0.873911 0.041012
C  -3.09462 -1.339932 0.03834
C  -2.886486 1.122907 -0.121149
C  -4.482319 -1.242707 0.013613
C  -4.273442 1.25428 -0.148219
C  -5.070919 0.06404 -0.080564
H  4.076591 -3.186806 0.211772
H  1.58476 -3.545645 0.240462
H  5.955879 -1.856955 -0.055404
H  5.81304 -0.23882 -0.797575
H  5.835396 -0.394392 0.968898
H  -2.604811 -2.314772 0.109304
H  -2.272645 2.027732 -0.172289
H  -5.114944 -2.133657 0.064286
H  -4.747969 2.237232 -0.219329
H  2.649566 3.74328 0.010272
