program: Gaussian 09
title: 000103447
version: EM64L-G09RevD.01
frameworkgroup: C1[X(C13H22O)]
method: RPBEPBE
basis: SDD
operation: Freq
keyword: #pfreq=noraman
keyword: PBEPBE/SDD
title: #p freq=noraman PBEPBE/SDD
converged: YES YES NO NO
title: Mulliken charges:
elementType: O C C C C C C C C C C C C C H H H H H H H H H H H H H H H H H H H H H H
charge: -0.193486 -0.121192 -0.462383 -0.425242 -0.498491 0.111010 -0.516332 -0.193656 -0.457970 -0.365180 -0.194595 -0.342645 -0.356572 -0.693790 0.245440 0.205029 0.236835 0.224687 0.211279 0.238438 0.253065 0.239751 0.213568 0.223444 0.197150 0.204146 0.203330 0.190817 0.224021 0.185361 0.188879 0.194491 0.195376 0.215654 0.209786 0.209978
chargesum: 0.00000
title: Mulliken charges with hydrogens summed into heavy atoms:
elementType: O C C C C C C C C C C C C C
charge: -0.193486 0.124248 -0.020519 0.010724 -0.006988 0.111010 -0.063013 0.029788 -0.056673 0.028967 0.029426 0.031594 0.033295 -0.058372
polarizability: 1.91221676e+02 -1.38147003e+00 1.28455709e+02 -3.28110048e+00 1.46424716e+00 1.11507607e+02
1716.lowfreq: -11.8220 -3.4089 -0.0008 0.0004 0.0006 10.2870 17.2208 24.9327 51.1635
frequency: 17.0948 24.6193 50.7141 59.0945 67.8729 87.1176 115.9808 118.1203 154.4284 162.7707 198.0061 225.1493 232.6600 275.4880 330.2471 346.2841 365.3226 454.3647 484.2742 503.5883 545.4175 555.8275 610.4023 720.6698 724.6533 751.1485 795.7698 818.5498 834.7864 863.0086 887.4892 894.5137 923.8271 936.2814 947.5827 973.1215 996.1169 1002.3067 1019.0036 1025.8414 1042.6743 1066.2880 1076.2242 1097.4424 1108.6937 1117.4014 1147.6128 1150.8555 1166.2762 1194.9765 1195.6532 1210.6898 1231.6465 1247.3907 1252.8999 1267.4439 1273.2783 1280.5908 1284.2736 1288.9252 1298.2852 1299.2526 1304.1758 1317.3536 1328.4716 1343.9309 1350.2183 1389.5681 1427.4721 1457.1761 1457.6452 1463.9309 1470.4281 1471.6371 1477.1274 1479.9692 1480.2567 1488.2932 1652.1419 1685.8541 2934.2189 2950.1645 2952.7268 2962.5065 2967.8949 2969.5846 2972.0057 2986.6786 2990.4222 2991.9361 3001.9502 3005.2551 3021.1169 3028.1111 3040.1331 3057.9500 3066.7184 3067.7966 3068.7202 3071.2316 3072.3719 3081.8451
redmass: 4.1115 4.1962 1.8614 2.9420 2.7098 2.8639 2.8525 1.8081 2.3137 3.3034 1.9127 3.0157 1.1116 3.6214 2.7270 2.9725 2.4977 2.8029 3.4106 2.4642 2.6848 3.2042 2.7052 2.4299 1.0854 1.1545 1.5545 1.8663 1.3985 2.1007 1.8026 1.8048 1.9939 1.6751 1.3087 1.1012 2.5289 2.2921 1.5246 2.2490 2.9887 1.4286 2.2398 2.1347 2.2301 2.5831 1.6507 3.0160 1.8231 1.4831 1.5381 1.4770 1.3023 1.2195 1.2644 1.3767 1.2671 1.2248 1.1951 1.1223 1.2367 1.3257 1.3845 1.5908 1.3927 1.4935 1.6237 1.2147 1.0799 1.0920 1.0842 1.0707 1.0748 1.0840 1.0429 1.0905 1.0794 1.0867 12.4102 6.5857 1.0804 1.0614 1.0586 1.0599 1.0595 1.0587 1.0371 1.0655 1.0967 1.0667 1.0634 1.0976 1.1019 1.0993 1.1034 1.0945 1.0953 1.0907 1.0981 1.0992 1.0977 1.1028
irintensity: 0.4559 1.4276 0.2891 1.5510 0.4434 1.6914 1.4687 0.4037 0.4585 2.5037 0.7768 1.1417 0.0064 3.8598 0.8717 0.4163 1.3178 0.6423 7.6774 0.4870 3.7503 4.9667 1.2158 1.0505 10.7290 0.4800 4.7421 9.8802 7.3727 1.6425 4.3203 2.0444 10.8040 9.6696 2.5355 45.9850 8.6982 4.7498 7.8364 4.4304 0.5084 8.5795 0.5828 0.8698 11.5744 6.3122 6.1724 88.9073 0.1381 5.1935 0.6986 5.8750 0.9066 4.5883 2.1958 6.0079 7.2171 1.8005 0.6642 0.6524 1.3178 2.3081 2.5397 5.2305 0.4460 0.9783 0.6490 11.1420 20.4686 11.3340 3.8706 0.3798 1.6537 11.5568 11.9244 4.2638 4.3465 20.5618 182.9780 0.0144 9.4229 17.7614 9.5884 6.5794 17.2693 125.3629 33.8458 12.9134 2.0130 25.7182 39.6874 3.3659 1.0844 12.5998 78.4273 2.2181 19.5837 21.0433 135.6750 54.7252 27.9897 53.5078
temp: 298.150 k
press: 1.00000 atm
elementType: 8 6 6 6 6 6 6 6 6 6 6 6 6 6 1 1 1 1 1 1 1 1 1 1 1 1 1 1 1 1 1 1 1 1 1 1
symmnumber: 1
zpe: 835623.1 jmol-1
zpe.correction: 0.318272 hartree
zpe.thermalcorrener: 0.334698 hartree
zpe.thermalcorrenthalpy: 0.335642 hartree
zpe.thermalcorrgfe: 0.271337 hartree
zpe.sumelectzpe: -582.669358 hartree
zpe.sumelectthermal: -582.652933 hartree
zpe.sumelectthermalent: -582.651989 hartree
zpe.sumelectthermalfe: -582.716293 hartree
dipole: -2.0533 2.7259 -0.0299
dipole: 3.4128
quadrupole: -100.8017 -91.0061 -83.6785
quadrupole: 13.9228 -0.3468 0.0376
quadrupole: -8.9729 0.8226 8.1503 13.9228 -0.3468 0.0376
hfenergy: -582.9876303 hartree
pointgroup: C01 [X(C13H22O1)]
dipole: 0.8146247 -1.0671973 -0.0184694 debye
polarizability: 191.2422911|-1.0022102|128.4564333|3.2161362|-1.3468827|111.4862674 unknown
InChI: InChI=1S/C13H22O/c1-2-3-4-5-6-7-9-12-10-8-11-13(12)14/h6-7,12H,2-5,8-11H2,1H3
charge 0 multiplicity 1
36 atoms
O  -4.710173 1.17082 -0.04661
C  -2.511108 0.061291 -0.398104
C  -2.088907 -1.359875 0.052492
C  -3.361238 -2.228028 -0.173738
C  -4.528809 -1.294492 0.232229
C  -4.018977 0.123608 -0.070823
C  -1.715206 1.252625 0.193989
C  -0.295461 1.324052 -0.325309
C  2.246763 1.350193 -0.077971
C  3.097332 0.106904 0.298818
C  0.826143 1.274447 0.440343
C  4.567084 0.221226 -0.163742
C  5.421902 -1.012289 0.207485
C  6.889863 -0.888368 -0.254971
H  -2.443248 0.117319 -1.508894
H  -1.826431 -1.341748 1.12911
H  -1.208954 -1.737046 -0.494371
H  -3.341678 -3.166659 0.405802
H  -3.447655 -2.498607 -1.243431
H  -4.72747 -1.353065 1.322021
H  -5.488085 -1.489507 -0.277546
H  -2.268901 2.179404 -0.06137
H  -1.71175 1.176494 1.299054
H  -0.186777 1.430081 -1.417941
H  2.747843 2.250204 0.338971
H  2.239243 1.474608 -1.179085
H  2.634632 -0.797861 -0.144711
H  3.068288 -0.03482 1.39942
H  0.716286 1.166324 1.532507
H  5.022699 1.130107 0.282956
H  4.596847 0.368485 -1.263841
H  5.390198 -1.159261 1.306528
H  4.966355 -1.919282 -0.240051
H  7.480293 -1.780595 0.023836
H  6.951027 -0.772632 -1.353744
H  7.375332 -0.00516 0.201694
