program: Gaussian 09
title: 000103446
version: EM64L-G09RevD.01
frameworkgroup: C1[X(C10H19NO2)]
method: RPBEPBE
basis: SDD
operation: Freq
keyword: #p
keyword: freq=noraman
keyword: PBEPBE/SDD
title: #p freq=noraman PBEPBE/SDD
converged: YES YES NO NO
title: Mulliken charges:
elementType: O O N C C C C C C C C C C H H H H H H H H H H H H H H H H H H H
charge: -0.423046 -0.223946 -0.385153 0.291293 0.296681 -0.157550 -0.466085 -0.450764 -0.716033 -0.741611 -0.741742 -0.714345 0.120703 0.256866 0.206532 0.234032 0.219258 0.219859 0.239467 0.213552 0.205362 0.212275 0.207853 0.237840 0.201458 0.237434 0.207225 0.204201 0.206214 0.214235 0.212403 0.375529
chargesum: 0.00000
title: Mulliken charges with hydrogens summed into heavy atoms:
elementType: O O N C C C C C C C C C C
charge: -0.047517 -0.223946 -0.145686 0.291293 0.296681 0.099315 -0.025520 -0.011647 -0.084843 -0.094460 -0.092881 -0.081493 0.120703
polarizability: 1.28798084e+02 -3.11588998e-01 1.25742031e+02 -3.56175517e-02 3.67012604e+00 1.04230729e+02
1716.lowfreq: -4.6085 -0.0011 -0.0011 -0.0010 10.5051 15.6648 23.7695 92.8573 123.4103
frequency: 23.7403 92.8061 123.4055 134.2870 139.9598 174.5635 226.5030 231.1642 250.7033 260.7711 275.2093 296.7552 302.9126 324.5830 341.2377 391.8414 400.0662 439.0462 446.7738 475.8518 492.6928 551.2108 560.6907 590.4996 597.5045 693.3332 768.8435 780.0636 865.4742 880.1248 885.7961 897.1458 905.6796 920.3592 928.1815 972.1122 986.9206 987.8288 1018.0841 1028.8497 1054.2487 1082.8890 1108.6516 1165.9486 1178.1570 1196.6007 1205.0399 1238.5094 1241.0530 1274.7683 1287.5454 1291.6840 1311.5647 1321.9138 1363.9625 1365.8310 1373.3194 1382.2445 1389.1707 1436.2510 1447.5883 1454.9997 1456.1482 1462.0549 1465.8026 1469.5564 1479.1662 1480.9512 1488.5364 1493.4551 1659.1832 2970.0564 2971.1220 2974.4467 2976.6853 2992.9453 3001.4340 3012.2920 3057.5591 3059.9250 3062.3602 3066.9527 3067.2058 3070.0025 3082.2008 3091.5420 3092.7391 3094.5419 3440.2066 3509.2988
redmass: 10.0554 3.3831 2.5072 2.8405 3.7831 1.0564 1.0662 1.8403 1.2576 3.1107 1.7659 1.7211 2.2209 3.1876 2.4734 2.8098 2.0814 1.9638 1.5388 2.9537 3.1495 2.5429 2.5984 2.4970 1.6317 3.4663 3.4422 3.1457 1.6901 2.5775 1.9821 2.9290 1.4860 1.6267 1.9384 1.8858 1.3294 1.5229 1.8666 1.8499 2.0198 1.4211 2.5822 2.1378 2.7244 2.3220 2.9712 2.1382 1.6331 2.3651 1.3948 1.5445 1.6244 1.4286 1.2274 1.4906 1.3228 1.2188 1.2099 1.1982 1.0846 1.0653 1.0565 1.0642 1.0595 1.0618 1.0571 1.0559 1.1513 1.0612 8.4688 1.0361 1.0361 1.0364 1.0369 1.0609 1.0607 1.0802 1.1004 1.0996 1.1005 1.0989 1.1000 1.0996 1.0988 1.0984 1.0997 1.0974 1.0742 1.0639
irintensity: 0.8932 0.0574 0.1484 1.7400 0.1305 0.0953 0.1274 1.8515 0.1409 1.4688 0.3173 1.6943 0.6847 0.9965 1.8846 0.6217 1.0354 19.1026 50.8006 1.1703 18.9806 55.2829 18.9566 52.1409 75.9936 34.9194 2.5280 4.7863 0.6144 0.2338 3.3413 3.4233 2.5974 12.3777 5.1910 5.4550 6.1506 24.3455 1.0031 92.7819 140.5783 9.8642 48.2103 19.1218 33.7164 5.0305 22.4795 32.9202 10.1666 19.6745 23.0164 18.8523 53.3445 14.5704 1.2977 12.0251 41.2938 36.2005 11.7093 15.4515 0.3989 1.9026 0.5250 2.9067 11.8730 18.9184 8.2596 1.7364 6.6064 20.9789 223.1655 13.5205 32.8072 36.3571 41.8274 18.9409 17.6175 9.9095 0.1892 1.0441 2.9160 71.4604 55.0613 59.3471 23.6502 67.5480 45.1637 20.9806 3.7234 18.7905
temp: 298.150 k
press: 1.00000 atm
elementType: 8 8 7 6 6 6 6 6 6 6 6 6 6 1 1 1 1 1 1 1 1 1 1 1 1 1 1 1 1 1 1 1
symmnumber: 1
zpe: 729027.5 jmol-1
zpe.correction: 0.277672 hartree
zpe.thermalcorrener: 0.292349 hartree
zpe.thermalcorrenthalpy: 0.293294 hartree
zpe.thermalcorrgfe: 0.237182 hartree
zpe.sumelectzpe: -596.616559 hartree
zpe.sumelectthermal: -596.601881 hartree
zpe.sumelectthermalent: -596.600937 hartree
zpe.sumelectthermalfe: -596.657048 hartree
dipole: 1.3061 1.2007 1.4421
dipole: 2.2863
quadrupole: -76.1368 -81.1285 -84.8920
quadrupole: -4.6145 -2.6243 -3.2610
quadrupole: 4.5823 -0.4094 -4.1729 -4.6145 -2.6243 -3.2610
hfenergy: -596.8942304 hartree
pointgroup: C01 [X(C10H19N1O2)]
dipole: -0.5439694 -0.4452209 0.5612334 debye
polarizability: 128.7622739|-0.3609042|125.6979059|0.3689715|-3.8892048|104.310664 unknown
InChI: InChI=1S/C10H19NO2/c1-9(2)5-7(8(12)13)6-10(3,4)11-9/h7,11-12H,5-6H2,1-4H3
charge 0 multiplicity 1
32 atoms
O  3.221366 -0.82499 0.830737
O  3.128358 0.865222 -0.754884
N  -1.726601 -0.012848 -0.465527
C  -1.210137 1.288229 0.045198
C  -1.099154 -1.319018 -0.124916
C  1.034591 0.060487 0.318296
C  0.324139 1.330547 -0.193576
C  0.430494 -1.199818 -0.371463
C  -1.541047 1.572408 1.547663
C  -1.881375 2.394126 -0.808752
C  -1.682221 -2.360004 -1.115461
C  -1.381121 -1.824062 1.328528
C  2.527653 0.119543 0.050199
H  0.914479 -0.048076 1.413307
H  0.743796 2.229373 0.295634
H  0.520469 1.428172 -1.277122
H  0.605567 -1.120694 -1.461837
H  0.93413 -2.11203 -0.003685
H  -2.753919 -0.058723 -0.443167
H  -1.259188 2.607672 1.818203
H  -2.626792 1.458754 1.728061
H  -1.012765 0.889837 2.234805
H  -1.493357 3.39324 -0.538262
H  -1.68896 2.213214 -1.880128
H  -2.977702 2.404169 -0.650505
H  -1.522715 -2.023118 -2.154203
H  -1.206084 -3.348204 -0.978929
H  -2.771121 -2.486068 -0.956854
H  -2.467465 -1.802047 1.536641
H  -1.031815 -2.866755 1.452044
H  -0.879267 -1.210715 2.096078
H  4.190765 -0.779321 0.607275
